Chloromethane
- Formula: CH3Cl
- Molecular weight: 50.488
- IUPAC Standard InChIKey: NEHMKBQYUWJMIP-UHFFFAOYSA-N
- CAS Registry Number: 74-87-3
- Chemical structure:
View 3d structure (requires JavaScript / HTML 5) - Other names: Methane, chloro-; Methyl chloride; Artic; Freon 40; Monochloromethane; CH3Cl; Chloor-methaan; Chlor-methan; Chlorure de methyle; Clorometano; Cloruro di metile; Methylchlorid; Metylu chlorek; R 40; Rcra waste number U045; UN 1063; Refrigerant R40

Gas phase thermochemistry data

Data compiled as indicated in comments:
DRB - Donald R. Burgess, Jr.
ALS - Hussein Y. Afeefy, Joel F. Liebman, and Stephen E. Stein
Quantity | Value | Units | Method | Reference | Comment |
---|---|---|---|---|---|
ΔfH°gas | -83.68 | kJ/mol | Review | Chase, 1998 | Data last reviewed in June, 1972 |
ΔfH°gas | -81.9 ± 1.5 | kJ/mol | Review | Manion, 2002 | adopted flame calorimetry data of Fletcher and Pilcher, 1971 with increased uncertainty to reflect other data; DRB |
ΔfH°gas | -81.96 ± 0.67 | kJ/mol | Ccb | Fletcher and Pilcher, 1971, 2 | ALS |
ΔfH°gas | -85.90 ± 0.59 | kJ/mol | Chyd | Lacher, Emery, et al., 1956 | Reanalyzed by Cox and Pilcher, 1970, Original value = -86.33 ± 0.59 kJ/mol; ALS |
Quantity | Value | Units | Method | Reference | Comment |
ΔcH°gas | -764.0 ± 0.50 | kJ/mol | Ccb | Fletcher and Pilcher, 1971, 2 | ALS |
Quantity | Value | Units | Method | Reference | Comment |
S°gas,1 bar | 234.36 | J/mol*K | Review | Chase, 1998 | Data last reviewed in June, 1972 |
Gas Phase Heat Capacity (Shomate Equation)
Cp° = A + B*t + C*t2 + D*t3 +
E/t2
H° − H°298.15= A*t + B*t2/2 +
C*t3/3 + D*t4/4 − E/t + F − H
S° = A*ln(t) + B*t + C*t2/2 + D*t3/3 −
E/(2*t2) + G
Cp = heat capacity (J/mol*K)
H° = standard enthalpy (kJ/mol)
S° = standard entropy (J/mol*K)
t = temperature (K) / 1000.
View plot Requires a JavaScript / HTML 5 canvas capable browser.
Temperature (K) | 298. to 1200. | 1200. to 6000. |
---|---|---|
A | 3.524690 | 88.66691 |
B | 136.9277 | 10.06834 |
C | -82.14196 | -1.928737 |
D | 20.22797 | 0.128191 |
E | 0.278032 | -19.76840 |
F | -89.19995 | -152.5311 |
G | 202.8391 | 286.4015 |
H | -83.68000 | -83.68000 |
Reference | Chase, 1998 | Chase, 1998 |
Comment | Data last reviewed in June, 1972 | Data last reviewed in June, 1972 |

Reaction thermochemistry data

Data compiled as indicated in comments:
B - John E. Bartmess
M - Michael M. Meot-Ner (Mautner) and Sharon G. Lias
ALS - Hussein Y. Afeefy, Joel F. Liebman, and Stephen E. Stein
Individual Reactions
By formula: Cl- + CH3Cl = (Cl- • CH3Cl)
Quantity | Value | Units | Method | Reference | Comment |
---|---|---|---|---|---|
ΔrH° | 43.5 ± 4.2 | kJ/mol | TDAs | Li, Ross, et al., 1996 | gas phase; B |
ΔrH° | 49.0 ± 8.4 | kJ/mol | TDAs | Hiraoka, Mizuno, et al., 2001 | gas phase; B |
ΔrH° | 51.0 ± 8.4 | kJ/mol | IMRE | Larson and McMahon, 1984 | gas phase; B,M |
ΔrH° | 36.0 ± 0.84 | kJ/mol | TDAs | Dougherty, Dalton, et al., 1974 | gas phase; B,M |
ΔrH° | 63.6 ± 8.4 | kJ/mol | TDAs | Yamdagni and Kebarle, 1971 | gas phase; B |
Quantity | Value | Units | Method | Reference | Comment |
ΔrS° | 85.8 | J/mol*K | N/A | Larson and McMahon, 1984, 2 | gas phase; switching reaction(Cl-)t-C4H9OH, Entropy change calculated or estimated; French, Ikuta, et al., 1982; M |
ΔrS° | 64.0 | J/mol*K | HPMS | Dougherty, Dalton, et al., 1974 | gas phase; Entropy change is questionable; M |
Quantity | Value | Units | Method | Reference | Comment |
ΔrG° | 24.3 ± 0.84 | kJ/mol | TDAs | Li, Ross, et al., 1996 | gas phase; B |
ΔrG° | 20.3 | kJ/mol | TDAs | Hiraoka, Mizuno, et al., 2001 | gas phase; B |
ΔrG° | 26. ± 8.4 | kJ/mol | IMRE | Larson and McMahon, 1984 | gas phase; B,M |
ΔrG° | 17.2 ± 2.1 | kJ/mol | TDAs | Dougherty, Dalton, et al., 1974 | gas phase; B |
ΔrG° | 45.2 ± 8.4 | kJ/mol | TDAs | Yamdagni and Kebarle, 1971 | gas phase; B |
CH2Cl- + =
By formula: CH2Cl- + H+ = CH3Cl
Quantity | Value | Units | Method | Reference | Comment |
---|---|---|---|---|---|
ΔrH° | 1672. ± 10. | kJ/mol | Endo | Hierl, Henchman, et al., 1992 | gas phase; HO- + ClCH3: 8.8±2.3 kcal/mol endo; B |
ΔrH° | 1657. ± 13. | kJ/mol | G+TS | Ingemann and Nibbering, 1985 | gas phase; B |
ΔrH° | 1659. ± 19. | kJ/mol | EIAE | Rogers, Simpson, et al., 2010 | gas phase; B |
ΔrH° | 1674. ± 8.4 | kJ/mol | IMRB | Poutsma, Nash, et al., 1997 | gas phase; B |
ΔrH° | 1670. ± 17. | kJ/mol | G+TS | Henchman, Hierl, et al., 1985 | gas phase; HO- + MeCl: 0.38±0.1 eV endo; B |
Quantity | Value | Units | Method | Reference | Comment |
ΔrG° | 1628. ± 13. | kJ/mol | IMRE | Ingemann and Nibbering, 1985 | gas phase; B |
ΔrG° | 1641. ± 17. | kJ/mol | IMRB | Henchman, Hierl, et al., 1985 | gas phase; HO- + MeCl: 0.38±0.1 eV endo; B |
By formula: (CH2Cl+ • CH3Cl) + CH3Cl = (CH2Cl+ • 2CH3Cl)
Quantity | Value | Units | Method | Reference | Comment |
---|---|---|---|---|---|
ΔrH° | 24. | kJ/mol | HPMS | Luczynski, Malicki, et al., 1974 | gas phase; DG from graph, Entropy change is questionable; M |
Quantity | Value | Units | Method | Reference | Comment |
ΔrS° | 29. | J/mol*K | HPMS | Luczynski, Malicki, et al., 1974 | gas phase; DG from graph, Entropy change is questionable; M |
Free energy of reaction
ΔrG° (kJ/mol) | T (K) | Method | Reference | Comment |
---|---|---|---|---|
18. | 182. | HPMS | Luczynski, Malicki, et al., 1974 | gas phase; DG from graph, Entropy change is questionable; M |
By formula: (CH4Cl+ • CH3Cl) + CH3Cl = (CH4Cl+ • 2CH3Cl)
Quantity | Value | Units | Method | Reference | Comment |
---|---|---|---|---|---|
ΔrH° | 18. | kJ/mol | HPMS | Luczynski, Malicki, et al., 1974 | gas phase; DG from graph, Entropy change is questionable; M |
Quantity | Value | Units | Method | Reference | Comment |
ΔrS° | 4.6 | J/mol*K | HPMS | Luczynski, Malicki, et al., 1974 | gas phase; DG from graph, Entropy change is questionable; M |
Free energy of reaction
ΔrG° (kJ/mol) | T (K) | Method | Reference | Comment |
---|---|---|---|---|
17. | 182. | HPMS | Luczynski, Malicki, et al., 1974 | gas phase; DG from graph, Entropy change is questionable; M |
By formula: CH2Cl+ + CH3Cl = (CH2Cl+ • CH3Cl)
Quantity | Value | Units | Method | Reference | Comment |
---|---|---|---|---|---|
ΔrH° | 29. | kJ/mol | HPMS | Luczynski, Malicki, et al., 1974 | gas phase; DG from graph, Entropy change is questionable; M |
Quantity | Value | Units | Method | Reference | Comment |
ΔrS° | -15. | J/mol*K | HPMS | Luczynski, Malicki, et al., 1974 | gas phase; DG from graph, Entropy change is questionable; M |
Free energy of reaction
ΔrG° (kJ/mol) | T (K) | Method | Reference | Comment |
---|---|---|---|---|
34. | 312. | HPMS | Luczynski, Malicki, et al., 1974 | gas phase; DG from graph, Entropy change is questionable; M |
By formula: C3H7+ + CH3Cl = (C3H7+ • CH3Cl)
Quantity | Value | Units | Method | Reference | Comment |
---|---|---|---|---|---|
ΔrH° | 95.8 | kJ/mol | PHPMS | Sen Sharma and Kebarle, 1978 | gas phase; Entropy change is questionable; M |
Quantity | Value | Units | Method | Reference | Comment |
ΔrS° | 186. | J/mol*K | PHPMS | Sen Sharma and Kebarle, 1978 | gas phase; Entropy change is questionable; M |
By formula: CH3+ + CH3Cl = (CH3+ • CH3Cl)
Quantity | Value | Units | Method | Reference | Comment |
---|---|---|---|---|---|
ΔrH° | 259. | kJ/mol | PHPMS | McMahon, Heinis, et al., 1988 | gas phase; switching reaction(CH3+)N2, Entropy change calculated or estimated, uses MCA(N2) = 202. kJ/mol; Foster, Williamson, et al., 1974; M |
By formula: Br- + CH3Cl = (Br- • CH3Cl)
Quantity | Value | Units | Method | Reference | Comment |
---|---|---|---|---|---|
ΔrH° | 45.6 ± 4.2 | kJ/mol | TDAs | Li, Ross, et al., 1996 | gas phase; B |
Quantity | Value | Units | Method | Reference | Comment |
ΔrG° | 20.3 ± 0.84 | kJ/mol | TDAs | Li, Ross, et al., 1996 | gas phase; B |
By formula: CN- + CH3Cl = (CN- • CH3Cl)
Quantity | Value | Units | Method | Reference | Comment |
---|---|---|---|---|---|
ΔrH° | 42.7 ± 4.2 | kJ/mol | TDAs | Li, Ross, et al., 1996 | gas phase; B |
Quantity | Value | Units | Method | Reference | Comment |
ΔrG° | 20.5 ± 0.84 | kJ/mol | TDAs | Li, Ross, et al., 1996 | gas phase; B |
By formula: CH3Cl2- + 2CH3Cl = C2H6Cl3-
Quantity | Value | Units | Method | Reference | Comment |
---|---|---|---|---|---|
ΔrH° | 46.44 | kJ/mol | N/A | Hiraoka, Mizuno, et al., 2001 | gas phase; B |
Quantity | Value | Units | Method | Reference | Comment |
ΔrG° | 16.5 | kJ/mol | TDAs | Hiraoka, Mizuno, et al., 2001 | gas phase; B |
By formula: C2H6Cl3- + 3CH3Cl = C3H9Cl4-
Quantity | Value | Units | Method | Reference | Comment |
---|---|---|---|---|---|
ΔrH° | 35.1 | kJ/mol | N/A | Hiraoka, Mizuno, et al., 2001 | gas phase; B |
Quantity | Value | Units | Method | Reference | Comment |
ΔrG° | 8.95 | kJ/mol | TDAs | Hiraoka, Mizuno, et al., 2001 | gas phase; B |
By formula: C3H9Cl4- + 4CH3Cl = C4H12Cl5-
Quantity | Value | Units | Method | Reference | Comment |
---|---|---|---|---|---|
ΔrH° | 31.8 | kJ/mol | N/A | Hiraoka, Mizuno, et al., 2001 | gas phase; B |
Quantity | Value | Units | Method | Reference | Comment |
ΔrG° | 5.61 | kJ/mol | TDAs | Hiraoka, Mizuno, et al., 2001 | gas phase; B |
By formula: C4H12Cl5- + 5CH3Cl = C5H15Cl6-
Quantity | Value | Units | Method | Reference | Comment |
---|---|---|---|---|---|
ΔrH° | 25.9 | kJ/mol | N/A | Hiraoka, Mizuno, et al., 2001 | gas phase; B |
Quantity | Value | Units | Method | Reference | Comment |
ΔrG° | 3.5 | kJ/mol | TDAs | Hiraoka, Mizuno, et al., 2001 | gas phase; B |
By formula: C5H15Cl6- + 6CH3Cl = C6H18Cl7-
Quantity | Value | Units | Method | Reference | Comment |
---|---|---|---|---|---|
ΔrH° | 24.3 | kJ/mol | N/A | Hiraoka, Mizuno, et al., 2001 | gas phase; B |
Quantity | Value | Units | Method | Reference | Comment |
ΔrG° | 1.8 | kJ/mol | TDAs | Hiraoka, Mizuno, et al., 2001 | gas phase; B |
By formula: C6H18Cl7- + 7CH3Cl = C7H21Cl8-
Quantity | Value | Units | Method | Reference | Comment |
---|---|---|---|---|---|
ΔrH° | 20.1 | kJ/mol | N/A | Hiraoka, Mizuno, et al., 2001 | gas phase; B |
Quantity | Value | Units | Method | Reference | Comment |
ΔrG° | 2.6 | kJ/mol | TDAs | Hiraoka, Mizuno, et al., 2001 | gas phase; B |
By formula: C7H21Cl8- + 8CH3Cl = C8H24Cl9-
Quantity | Value | Units | Method | Reference | Comment |
---|---|---|---|---|---|
ΔrH° | 19.7 | kJ/mol | N/A | Hiraoka, Mizuno, et al., 2001 | gas phase; B |
Quantity | Value | Units | Method | Reference | Comment |
ΔrG° | 2.2 | kJ/mol | TDAs | Hiraoka, Mizuno, et al., 2001 | gas phase; B |
By formula: C2H5+ + CH3Cl = (C2H5+ • CH3Cl)
Quantity | Value | Units | Method | Reference | Comment |
---|---|---|---|---|---|
ΔrH° | 128. | kJ/mol | PHPMS | Sen Sharma and Kebarle, 1978 | gas phase; M |
Quantity | Value | Units | Method | Reference | Comment |
ΔrS° | 128. | J/mol*K | PHPMS | Sen Sharma and Kebarle, 1978 | gas phase; M |
By formula: Li+ + CH3Cl = (Li+ • CH3Cl)
Quantity | Value | Units | Method | Reference | Comment |
---|---|---|---|---|---|
ΔrH° | 100. | kJ/mol | ICR | Staley and Beauchamp, 1975 | gas phase; switching reaction(Li+)H2O, from graph; Dzidic and Kebarle, 1970 interpolated; M |
By formula: C4H9+ + CH3Cl = (C4H9+ • CH3Cl)
Quantity | Value | Units | Method | Reference | Comment |
---|---|---|---|---|---|
ΔrH° | 35. | kJ/mol | PHPMS | Sharma, Meza de Hojer, et al., 1985 | gas phase; M |
Quantity | Value | Units | Method | Reference | Comment |
ΔrS° | 80.8 | J/mol*K | PHPMS | Sharma, Meza de Hojer, et al., 1985 | gas phase; M |
By formula: CH6N+ + CH3Cl = (CH6N+ • CH3Cl)
Quantity | Value | Units | Method | Reference | Comment |
---|---|---|---|---|---|
ΔrH° | 44.8 | kJ/mol | PHPMS | Meot-Ner, 1984 | gas phase; M |
Quantity | Value | Units | Method | Reference | Comment |
ΔrS° | 86.2 | J/mol*K | PHPMS | Meot-Ner, 1984 | gas phase; M |
By formula: H2 + CH3Cl = CH4 + HCl
Quantity | Value | Units | Method | Reference | Comment |
---|---|---|---|---|---|
ΔrH° | -80.8 ± 0.4 | kJ/mol | Chyd | Lacher, Emery, et al., 1956 | gas phase; ALS |

Henry's Law data

Data compiled by: Rolf Sander
Henry's Law constant (water solution)
kH(T) = k°H exp(d(ln(kH))/d(1/T) ((1/T) - 1/(298.15 K)))
k°H = Henry's law constant for solubility in water at 298.15 K (mol/(kg*bar))
d(ln(kH))/d(1/T) = Temperature dependence constant (K)
k°H (mol/(kg*bar)) | d(ln(kH))/d(1/T) (K) | Method | Reference | Comment |
---|---|---|---|---|
0.094 | 3000. | M | N/A | |
0.12 | Q | N/A | missing citation give several references for the Henry's law constants but don't assign them to specific species. | |
0.12 | 4200. | M | Gossett, 1987 | |
0.029 | -630. | X | N/A | |
0.11 | L | N/A | ||
0.099 | 2900. | X | N/A | |
0.11 | V | N/A | ||
0.12 | V | N/A | Value at T = 293. K. | |
0.10 | 2800. | L | N/A | |
0.10 | V | N/A | ||
0.13 | M | Pearson and McConnell, 1975 | The same data was also published in missing citation. Value at T = 293. K. |

Kovats' RI, non-polar column, isothermal

Column type | Active phase | Temperature (C) | I | Reference | Comment |
---|---|---|---|---|---|
Packed | Squalane | 80. | 329. | Pacáková, Vojtechová, et al., 1988 | N2, Chezasorb AW-HMDS; Column length: 1.2 m |
Packed | Squalane | 27. | 324. | Hively and Hinton, 1968 | He, Chromosorb P; Column length: 15. m; Column diameter: 0.25 mm |
Packed | Squalane | 49. | 326. | Hively and Hinton, 1968 | He, Chromosorb P; Column length: 15. m; Column diameter: 0.25 mm |
Packed | Squalane | 67. | 327. | Hively and Hinton, 1968 | He, Chromosorb P; Column length: 15. m; Column diameter: 0.25 mm |
Packed | Squalane | 86. | 329. | Hively and Hinton, 1968 | He, Chromosorb P; Column length: 15. m; Column diameter: 0.25 mm |

Van Den Dool and Kratz RI, non-polar column, temperature ramp

Column type | Active phase | I | Reference | Comment |
---|---|---|---|---|
Capillary | Petrocol DH | 332.92 | White, Douglas, et al., 1992 | 100. m/0.25 mm/0.5 μm, He, 1. K/min; Tstart: 30. C; Tend: 220. C |
Capillary | Petrocol DH | 332.92 | White, Douglas, et al., 1992 | 100. m/0.25 mm/0.5 μm, He, 1. K/min; Tstart: 30. C; Tend: 220. C |

Normal alkane RI, non-polar column, temperature ramp

Column type | Active phase | I | Reference | Comment |
---|---|---|---|---|
Capillary | OV-101 | 332. | Zenkevich, 2005 | 25. m/0.20 mm/0.10 μm, N2/He, 6. K/min; Tstart: 50. C; Tend: 250. C |

Normal alkane RI, non-polar column, custom temperature program

Column type | Active phase | I | Reference | Comment |
---|---|---|---|---|
Capillary | Polydimethyl siloxanes | 332. | Zenkevich, Eliseenkov, et al., 2006 | Program: not specified |
Capillary | Methyl Silicone | 340. | Blunden, Aneja, et al., 2005 | 60. m/0.32 mm/1.0 μm, Helium; Program: -50 0C (2 min) 8 0C/min -> 200 0C (7.75 min) 25 0C -> 225 0C (8 min) |
Capillary | Methyl Silicone | 332. | Zenkevich, 1999 | Program: not specified |
Capillary | Methyl Silicone | 326. | Zenkevich, 1998 | Program: not specified |
Capillary | Polydimethyl siloxanes | 332. | Zenkevich and Chupalov, 1996 | Program: not specified |
Capillary | Polydimethyl siloxanes | 332. | Zenkevich and Chupalov, 1996 | Program: not specified |

Condensed phase thermochemistry data

Data compiled as indicated in comments:
DRB - Donald R. Burgess, Jr.
DH - Eugene S. Domalski and Elizabeth D. Hearing
Quantity | Value | Units | Method | Reference | Comment |
---|---|---|---|---|---|
ΔfH°liquid | -24.47 ± 0.36 | kcal/mol | Review | Manion, 2002 | derived from recommended ΔfHgas° and ΔvapH°; DRB |
Quantity | Value | Units | Method | Reference | Comment |
S°liquid | 33.480 | cal/mol*K | N/A | Messerly and Aston, 1940 | DH |
Constant pressure heat capacity of liquid
Cp,liquid (cal/mol*K) | Temperature (K) | Reference | Comment |
---|---|---|---|
19.3 | 293.15 | Awberg and Griffiths, 1940 | T = 243 to 303 K. Cp reported at 20°C = 1.598 J/g*K and at 30°C = 1.632 J/g*K.; DH |
18.07 | 249.67 | Messerly and Aston, 1940 | T = 12 to 249.67 K. Value is unsmoothed experimental datum.; DH |
19.4 | 298. | Shorthose, 1924 | T = -30 to 40°C.; DH |

Phase change data

Data compiled as indicated in comments:
TRC - Thermodynamics Research Center, NIST Boulder Laboratories, Chris Muzny director
DRB - Donald R. Burgess, Jr.
DH - Eugene S. Domalski and Elizabeth D. Hearing
AC - William E. Acree, Jr., James S. Chickos
ALS - Hussein Y. Afeefy, Joel F. Liebman, and Stephen E. Stein
Quantity | Value | Units | Method | Reference | Comment |
---|---|---|---|---|---|
Tboil | 247. ± 10. | K | AVG | N/A | Average of 9 values; Individual data points |
Quantity | Value | Units | Method | Reference | Comment |
Tfus | 182. | K | N/A | Awbery, 1941 | Uncertainty assigned by TRC = 1.5 K; TRC |
Tfus | 175.55 | K | N/A | Timmermans, 1921 | Uncertainty assigned by TRC = 0.4 K; TRC |
Tfus | 176.5 | K | N/A | Timmermans, 1911 | Uncertainty assigned by TRC = 0.5 K; TRC |
Quantity | Value | Units | Method | Reference | Comment |
Ttriple | 175.43 | K | N/A | Messerly and Aston, 1940, 2 | Uncertainty assigned by TRC = 0.07 K; from T vs 1/f in a calorimter, Resistance thermomter and thermocouple gave same temperature, temp. scale in previous publication; TRC |
Ttriple | 175.44 | K | N/A | Messerly and Aston, 1940, 2 | Uncertainty assigned by TRC = 0.05 K; from T vs 1/f in adiabatic calorimeter, temp. meas. with resistance thermometer & two thermocouples, temp scale described in previous publication; TRC |
Quantity | Value | Units | Method | Reference | Comment |
Ptriple | 0.008587 | atm | N/A | Messerly and Aston, 1940, 2 | Uncertainty assigned by TRC = 0.000013 atm; TRC |
Quantity | Value | Units | Method | Reference | Comment |
Tc | 416. ± 1. | K | AVG | N/A | Average of 6 values; Individual data points |
Quantity | Value | Units | Method | Reference | Comment |
Pc | 66.266 | atm | N/A | Mansoorian, Hall, et al., 1981 | Uncertainty assigned by TRC = 0.0066 atm; VP measured up to 408 K,; TRC |
Pc | 65.9190 | atm | N/A | Hsu and McKetta, 1964 | Uncertainty assigned by TRC = 0.0400 atm; TRC |
Pc | 65.93 | atm | N/A | Leduc, 1909 | Uncertainty assigned by TRC = 2.0000 atm; TRC |
Pc | 73.03 | atm | N/A | Vincent and Chappuis, 1886 | Uncertainty assigned by TRC = 3.0000 atm; TRC |
Quantity | Value | Units | Method | Reference | Comment |
ρc | 7.1895 | mol/l | N/A | Hsu and McKetta, 1964 | Uncertainty assigned by TRC = 0.006 mol/l; TRC |
ρc | 7.33 | mol/l | N/A | Centnerszwer, 1904 | Uncertainty assigned by TRC = 0.1 mol/l; extrapolation of rectilnear diam. to Tc; TRC |
Quantity | Value | Units | Method | Reference | Comment |
ΔvapH° | 4.90 ± 0.07 | kcal/mol | Review | Manion, 2002 | weighted average of several measurements plus a correction for non-ideality; DRB |
Enthalpy of vaporization
ΔvapH (kcal/mol) | Temperature (K) | Method | Reference | Comment |
---|---|---|---|---|
5.1470 | 248.94 | N/A | Messerly and Aston, 1940 | P = 101.325 kPA; DH |
5.43 | 235. | N/A | Beersmans and Jungers, 2010 | Based on data from 183. to 250. K.; AC |
5.26 | 263. | N/A | Ganeff and Jungers, 2010 | Based on data from 198. to 278. K.; AC |
5.26 | 262. | A | Stephenson and Malanowski, 1987 | Based on data from 247. to 310. K.; AC |
5.21 | 383. | A | Stephenson and Malanowski, 1987 | Based on data from 368. to 416. K.; AC |
5.02 | 323. | A | Stephenson and Malanowski, 1987 | Based on data from 308. to 373. K.; AC |
5.62 | 206. | N/A | Thomson, 1946 | Based on data from 191. to 249. K.; AC |
5.40 | 234. | N/A | Messerly and Aston, 1940 | Based on data from 192. to 249. K.; AC |
4.801 | 293. | C | Yates, 1926 | ALS |
4.80 | 293. | C | Yates, 1926 | AC |
Entropy of vaporization
ΔvapS (cal/mol*K) | Temperature (K) | Reference | Comment |
---|---|---|---|
20.68 | 248.94 | Messerly and Aston, 1940 | P; DH |
Antoine Equation Parameters
log10(P) = A − (B / (T + C))
P = vapor pressure (atm)
T = temperature (K)
View plot Requires a JavaScript / HTML 5 canvas capable browser.
Temperature (K) | A | B | C | Reference | Comment |
---|---|---|---|---|---|
303. to 416.3 | 4.91287 | 1427.529 | 45.137 | Hsu and McKetta, 1964 | Coefficents calculated by NIST from author's data. |
198. to 278. | 4.21936 | 951.561 | -23.468 | Ganeff and Jungers, 1948 | Coefficents calculated by NIST from author's data. |
183. to 249.4 | 4.14883 | 916.223 | -28.466 | Beersmans and Jungers, 1947 | Coefficents calculated by NIST from author's data. |
Enthalpy of sublimation
ΔsubH (kcal/mol) | Temperature (K) | Reference | Comment |
---|---|---|---|
7.55 ± 0.02 | 151. | Bah and Dupont-Pavlovsky, 1995 | Based on data from 130. to 172. K.; AC |
Enthalpy of fusion
ΔfusH (kcal/mol) | Temperature (K) | Reference | Comment |
---|---|---|---|
1.537 | 175.44 | Messerly and Aston, 1940 | DH |
1.53 | 174.5 | Domalski and Hearing, 1996 | AC |
Entropy of fusion
ΔfusS (cal/mol*K) | Temperature (K) | Reference | Comment |
---|---|---|---|
8.762 | 175.44 | Messerly and Aston, 1940 | DH |

Gas phase ion energetics data

Data evaluated as indicated in comments:
HL - Edward P. Hunter and Sharon G. Lias
L - Sharon G. Lias
Data compiled as indicated in comments:
B - John E. Bartmess
LLK - Sharon G. Lias, Rhoda D. Levin, and Sherif A. Kafafi
RDSH - Henry M. Rosenstock, Keith Draxl, Bruce W. Steiner, and John T. Herron
Quantity | Value | Units | Method | Reference | Comment |
---|---|---|---|---|---|
IE (evaluated) | 11.26 ± 0.03 | eV | N/A | N/A | L |
Quantity | Value | Units | Method | Reference | Comment |
Proton affinity (review) | 154.7 | kcal/mol | N/A | Hunter and Lias, 1998 | HL |
Quantity | Value | Units | Method | Reference | Comment |
Gas basicity | 148.4 | kcal/mol | N/A | Hunter and Lias, 1998 | HL |
Ionization energy determinations
IE (eV) | Method | Reference | Comment |
---|---|---|---|
11.221 | S | Hochmann, Templet, et al., 1975 | LLK |
11.28 ± 0.01 | PI | Werner, Tsai, et al., 1974 | LLK |
11.27 | EI | Lossing, 1972 | LLK |
11.29 | PE | Ragle, Stenhouse, et al., 1970 | RDSH |
11.26 | PE | Dewar and Worley, 1969 | RDSH |
11.265 ± 0.003 | PI | Nicholson, 1965 | RDSH |
11.28 | PI | Dibeler and Walker, 1965 | RDSH |
11.28 ± 0.01 | PI | Watanabe, 1957 | RDSH |
11.22 ± 0.01 | S | Price, 1936 | RDSH |
11.29 | PE | Kimura, Katsumata, et al., 1981 | Vertical value; LLK |
11.29 | PE | Utsunomiya, Kobayashi, et al., 1980 | Vertical value; LLK |
11.33 | PE | Uehara, Saito, et al., 1973 | Vertical value; LLK |
11.30 | PE | Dixon, Murrell, et al., 1971 | Vertical value; LLK |
Appearance energy determinations
Ion | AE (eV) | Other Products | Method | Reference | Comment |
---|---|---|---|---|---|
C+ | 26.3 ± 0.1 | ? | EI | Reed and Snedden, 1956 | RDSH |
CH+ | 22.5 ± 0.06 | ? | EI | Reed and Snedden, 1956 | RDSH |
CH2+ | 14.6 ± 0.2 | HCl | EI | Tsuda and Hamill, 1964 | RDSH |
CH2Cl+ | 12.96 | H | EI | Lossing, 1972 | LLK |
CH2Cl+ | 12.98 ± 0.07 | H | EI | Martin, Lampe, et al., 1966 | RDSH |
CH3+ | 13.87 | Cl | PI | Krauss, Walker, et al., 1968 | RDSH |
CH3+ | 10.07 | Cl- | PI | Dibeler and Walker, 1965 | RDSH |
Cl+ | 16.6 ± 0.05 | CH3 | EI | Tsuda, Melton, et al., 1964 | RDSH |
De-protonation reactions
CH2Cl- + =
By formula: CH2Cl- + H+ = CH3Cl
Quantity | Value | Units | Method | Reference | Comment |
---|---|---|---|---|---|
ΔrH° | 399.6 ± 2.5 | kcal/mol | Endo | Hierl, Henchman, et al., 1992 | gas phase; HO- + ClCH3: 8.8±2.3 kcal/mol endo; B |
ΔrH° | 396.0 ± 3.1 | kcal/mol | G+TS | Ingemann and Nibbering, 1985 | gas phase; B |
ΔrH° | 396.6 ± 4.6 | kcal/mol | EIAE | Rogers, Simpson, et al., 2010 | gas phase; B |
ΔrH° | 400.0 ± 2.0 | kcal/mol | IMRB | Poutsma, Nash, et al., 1997 | gas phase; B |
ΔrH° | 399.1 ± 4.1 | kcal/mol | G+TS | Henchman, Hierl, et al., 1985 | gas phase; HO- + MeCl: 0.38±0.1 eV endo; B |
Quantity | Value | Units | Method | Reference | Comment |
ΔrG° | 389.1 ± 3.0 | kcal/mol | IMRE | Ingemann and Nibbering, 1985 | gas phase; B |
ΔrG° | 392.2 ± 4.0 | kcal/mol | IMRB | Henchman, Hierl, et al., 1985 | gas phase; HO- + MeCl: 0.38±0.1 eV endo; B |

Ion clustering data

Data compiled as indicated in comments:
B - John E. Bartmess
M - Michael M. Meot-Ner (Mautner) and Sharon G. Lias
Clustering reactions
By formula: Br- + CH3Cl = (Br- • CH3Cl)
Quantity | Value | Units | Method | Reference | Comment |
---|---|---|---|---|---|
ΔrH° | 10.9 ± 1.0 | kcal/mol | TDAs | Li, Ross, et al., 1996 | gas phase; B |
Quantity | Value | Units | Method | Reference | Comment |
ΔrG° | 4.85 ± 0.20 | kcal/mol | TDAs | Li, Ross, et al., 1996 | gas phase; B |
By formula: CH2Cl+ + CH3Cl = (CH2Cl+ • CH3Cl)
Quantity | Value | Units | Method | Reference | Comment |
---|---|---|---|---|---|
ΔrH° | 6.9 | kcal/mol | HPMS | Luczynski, Malicki, et al., 1974 | gas phase; DG from graph, Entropy change is questionable; M |
Quantity | Value | Units | Method | Reference | Comment |
ΔrS° | -3.7 | cal/mol*K | HPMS | Luczynski, Malicki, et al., 1974 | gas phase; DG from graph, Entropy change is questionable; M |
Free energy of reaction
ΔrG° (kcal/mol) | T (K) | Method | Reference | Comment |
---|---|---|---|---|
8.1 | 312. | HPMS | Luczynski, Malicki, et al., 1974 | gas phase; DG from graph, Entropy change is questionable; M |
By formula: (CH2Cl+ • CH3Cl) + CH3Cl = (CH2Cl+ • 2CH3Cl)
Quantity | Value | Units | Method | Reference | Comment |
---|---|---|---|---|---|
ΔrH° | 5.7 | kcal/mol | HPMS | Luczynski, Malicki, et al., 1974 | gas phase; DG from graph, Entropy change is questionable; M |
Quantity | Value | Units | Method | Reference | Comment |
ΔrS° | 6.9 | cal/mol*K | HPMS | Luczynski, Malicki, et al., 1974 | gas phase; DG from graph, Entropy change is questionable; M |
Free energy of reaction
ΔrG° (kcal/mol) | T (K) | Method | Reference | Comment |
---|---|---|---|---|
4.4 | 182. | HPMS | Luczynski, Malicki, et al., 1974 | gas phase; DG from graph, Entropy change is questionable; M |
By formula: CH3+ + CH3Cl = (CH3+ • CH3Cl)
Quantity | Value | Units | Method | Reference | Comment |
---|---|---|---|---|---|
ΔrH° | 62.0 | kcal/mol | PHPMS | McMahon, Heinis, et al., 1988 | gas phase; switching reaction(CH3+)N2, Entropy change calculated or estimated, uses MCA(N2) = 48.3 kcal/mol; Foster, Williamson, et al., 1974; M |
By formula: CH3Cl2- + 2CH3Cl = C2H6Cl3-
Quantity | Value | Units | Method | Reference | Comment |
---|---|---|---|---|---|
ΔrH° | 11.10 | kcal/mol | N/A | Hiraoka, Mizuno, et al., 2001 | gas phase; B |
Quantity | Value | Units | Method | Reference | Comment |
ΔrG° | 3.94 | kcal/mol | TDAs | Hiraoka, Mizuno, et al., 2001 | gas phase; B |
By formula: (CH4Cl+ • CH3Cl) + CH3Cl = (CH4Cl+ • 2CH3Cl)
Quantity | Value | Units | Method | Reference | Comment |
---|---|---|---|---|---|
ΔrH° | 4.2 | kcal/mol | HPMS | Luczynski, Malicki, et al., 1974 | gas phase; DG from graph, Entropy change is questionable; M |
Quantity | Value | Units | Method | Reference | Comment |
ΔrS° | 1.1 | cal/mol*K | HPMS | Luczynski, Malicki, et al., 1974 | gas phase; DG from graph, Entropy change is questionable; M |
Free energy of reaction
ΔrG° (kcal/mol) | T (K) | Method | Reference | Comment |
---|---|---|---|---|
4.0 | 182. | HPMS | Luczynski, Malicki, et al., 1974 | gas phase; DG from graph, Entropy change is questionable; M |
By formula: CH6N+ + CH3Cl = (CH6N+ • CH3Cl)
Quantity | Value | Units | Method | Reference | Comment |
---|---|---|---|---|---|
ΔrH° | 10.7 | kcal/mol | PHPMS | Meot-Ner, 1984 | gas phase; M |
Quantity | Value | Units | Method | Reference | Comment |
ΔrS° | 20.6 | cal/mol*K | PHPMS | Meot-Ner, 1984 | gas phase; M |
By formula: CN- + CH3Cl = (CN- • CH3Cl)
Quantity | Value | Units | Method | Reference | Comment |
---|---|---|---|---|---|
ΔrH° | 10.2 ± 1.0 | kcal/mol | TDAs | Li, Ross, et al., 1996 | gas phase; B |
Quantity | Value | Units | Method | Reference | Comment |
ΔrG° | 4.90 ± 0.20 | kcal/mol | TDAs | Li, Ross, et al., 1996 | gas phase; B |
By formula: C2H5+ + CH3Cl = (C2H5+ • CH3Cl)
Quantity | Value | Units | Method | Reference | Comment |
---|---|---|---|---|---|
ΔrH° | 30.7 | kcal/mol | PHPMS | Sen Sharma and Kebarle, 1978 | gas phase; M |
Quantity | Value | Units | Method | Reference | Comment |
ΔrS° | 30.7 | cal/mol*K | PHPMS | Sen Sharma and Kebarle, 1978 | gas phase; M |
By formula: C2H6Cl3- + 3CH3Cl = C3H9Cl4-
Quantity | Value | Units | Method | Reference | Comment |
---|---|---|---|---|---|
ΔrH° | 8.40 | kcal/mol | N/A | Hiraoka, Mizuno, et al., 2001 | gas phase; B |
Quantity | Value | Units | Method | Reference | Comment |
ΔrG° | 2.14 | kcal/mol | TDAs | Hiraoka, Mizuno, et al., 2001 | gas phase; B |
By formula: C3H7+ + CH3Cl = (C3H7+ • CH3Cl)
Quantity | Value | Units | Method | Reference | Comment |
---|---|---|---|---|---|
ΔrH° | 22.9 | kcal/mol | PHPMS | Sen Sharma and Kebarle, 1978 | gas phase; Entropy change is questionable; M |
Quantity | Value | Units | Method | Reference | Comment |
ΔrS° | 44.5 | cal/mol*K | PHPMS | Sen Sharma and Kebarle, 1978 | gas phase; Entropy change is questionable; M |
By formula: C3H9Cl4- + 4CH3Cl = C4H12Cl5-
Quantity | Value | Units | Method | Reference | Comment |
---|---|---|---|---|---|
ΔrH° | 7.60 | kcal/mol | N/A | Hiraoka, Mizuno, et al., 2001 | gas phase; B |
Quantity | Value | Units | Method | Reference | Comment |
ΔrG° | 1.34 | kcal/mol | TDAs | Hiraoka, Mizuno, et al., 2001 | gas phase; B |
By formula: C4H9+ + CH3Cl = (C4H9+ • CH3Cl)
Quantity | Value | Units | Method | Reference | Comment |
---|---|---|---|---|---|
ΔrH° | 8.4 | kcal/mol | PHPMS | Sharma, Meza de Hojer, et al., 1985 | gas phase; M |
Quantity | Value | Units | Method | Reference | Comment |
ΔrS° | 19.3 | cal/mol*K | PHPMS | Sharma, Meza de Hojer, et al., 1985 | gas phase; M |
By formula: C4H12Cl5- + 5CH3Cl = C5H15Cl6-
Quantity | Value | Units | Method | Reference | Comment |
---|---|---|---|---|---|
ΔrH° | 6.20 | kcal/mol | N/A | Hiraoka, Mizuno, et al., 2001 | gas phase; B |
Quantity | Value | Units | Method | Reference | Comment |
ΔrG° | 0.83 | kcal/mol | TDAs | Hiraoka, Mizuno, et al., 2001 | gas phase; B |
By formula: C5H15Cl6- + 6CH3Cl = C6H18Cl7-
Quantity | Value | Units | Method | Reference | Comment |
---|---|---|---|---|---|
ΔrH° | 5.80 | kcal/mol | N/A | Hiraoka, Mizuno, et al., 2001 | gas phase; B |
Quantity | Value | Units | Method | Reference | Comment |
ΔrG° | 0.43 | kcal/mol | TDAs | Hiraoka, Mizuno, et al., 2001 | gas phase; B |
By formula: C6H18Cl7- + 7CH3Cl = C7H21Cl8-
Quantity | Value | Units | Method | Reference | Comment |
---|---|---|---|---|---|
ΔrH° | 4.80 | kcal/mol | N/A | Hiraoka, Mizuno, et al., 2001 | gas phase; B |
Quantity | Value | Units | Method | Reference | Comment |
ΔrG° | 0.63 | kcal/mol | TDAs | Hiraoka, Mizuno, et al., 2001 | gas phase; B |
By formula: C7H21Cl8- + 8CH3Cl = C8H24Cl9-
Quantity | Value | Units | Method | Reference | Comment |
---|---|---|---|---|---|
ΔrH° | 4.70 | kcal/mol | N/A | Hiraoka, Mizuno, et al., 2001 | gas phase; B |
Quantity | Value | Units | Method | Reference | Comment |
ΔrG° | 0.53 | kcal/mol | TDAs | Hiraoka, Mizuno, et al., 2001 | gas phase; B |
By formula: Cl- + CH3Cl = (Cl- • CH3Cl)
Quantity | Value | Units | Method | Reference | Comment |
---|---|---|---|---|---|
ΔrH° | 10.4 ± 1.0 | kcal/mol | TDAs | Li, Ross, et al., 1996 | gas phase; B |
ΔrH° | 11.7 ± 2.0 | kcal/mol | TDAs | Hiraoka, Mizuno, et al., 2001 | gas phase; B |
ΔrH° | 12.2 ± 2.0 | kcal/mol | IMRE | Larson and McMahon, 1984 | gas phase; B,M |
ΔrH° | 8.60 ± 0.20 | kcal/mol | TDAs | Dougherty, Dalton, et al., 1974 | gas phase; B,M |
ΔrH° | 15.2 ± 2.0 | kcal/mol | TDAs | Yamdagni and Kebarle, 1971 | gas phase; B |
Quantity | Value | Units | Method | Reference | Comment |
ΔrS° | 20.5 | cal/mol*K | N/A | Larson and McMahon, 1984, 2 | gas phase; switching reaction(Cl-)t-C4H9OH, Entropy change calculated or estimated; French, Ikuta, et al., 1982; M |
ΔrS° | 15.3 | cal/mol*K | HPMS | Dougherty, Dalton, et al., 1974 | gas phase; Entropy change is questionable; M |
Quantity | Value | Units | Method | Reference | Comment |
ΔrG° | 5.80 ± 0.20 | kcal/mol | TDAs | Li, Ross, et al., 1996 | gas phase; B |
ΔrG° | 4.84 | kcal/mol | TDAs | Hiraoka, Mizuno, et al., 2001 | gas phase; B |
ΔrG° | 6.1 ± 2.0 | kcal/mol | IMRE | Larson and McMahon, 1984 | gas phase; B,M |
ΔrG° | 4.10 ± 0.50 | kcal/mol | TDAs | Dougherty, Dalton, et al., 1974 | gas phase; B |
ΔrG° | 10.8 ± 2.0 | kcal/mol | TDAs | Yamdagni and Kebarle, 1971 | gas phase; B |
By formula: Li+ + CH3Cl = (Li+ • CH3Cl)
Quantity | Value | Units | Method | Reference | Comment |
---|---|---|---|---|---|
ΔrH° | 25. | kcal/mol | ICR | Staley and Beauchamp, 1975 | gas phase; switching reaction(Li+)H2O, from graph; Dzidic and Kebarle, 1970 interpolated; M |

References

Chase, 1998
Chase, M.W., Jr.,
NIST-JANAF Themochemical Tables, Fourth Edition,
J. Phys. Chem. Ref. Data, Monograph 9, 1998, 1-1951. [all data]
Manion, 2002
Manion, J.A.,
Evaluated Enthalpies of Formation of the Stable Closed Shell C1 and C2 Chlorinated Hydrocarbons,
J. Phys. Chem. Ref. Data, 2002, 31, 1, 123-172, https://doi.org/10.1063/1.1420703
. [all data]
Fletcher and Pilcher, 1971
Fletcher, R.A.; Pilcher, G.,
Measurements of heats of combustion by flame calorimetry. Part 7.?Chloromethane, chloroethane, 1-chloropropane, 2-chloropropane,
Trans. Faraday Soc., 1971, 67, 3191, https://doi.org/10.1039/tf9716703191
. [all data]
Fletcher and Pilcher, 1971, 2
Fletcher, R.A.; Pilcher, G.,
Measurements of heats of combustion by flame calorimetry. Part 7.-Chloromethane, chloroethane, 1-chloropropane, 2-chloropropane,
Trans. Faraday Soc., 1971, 67, 3191-3201. [all data]
Lacher, Emery, et al., 1956
Lacher, J.R.; Emery, E.; Bohmfalk, E.; Park, J.D.,
Reaction heats of organic compounds. IV. A high temperature calorimeter and the hydrogenation of methyl ethyl and vinyl chlorides,
J. Phys. Chem., 1956, 60, 492-495. [all data]
Cox and Pilcher, 1970
Cox, J.D.; Pilcher, G.,
Thermochemistry of Organic and Organometallic Compounds, Academic Press, New York, 1970, 1-636. [all data]
Li, Ross, et al., 1996
Li, C.; Ross, P.; Szulejko, J.; McMahon, T.B.,
High-Pressure Mass Spectrometric Investigations of the Potential Energy Surfaces of Gas-Phase Sn2 Reactions.,
J. Am. Chem. Soc., 1996, 118, 39, 9360, https://doi.org/10.1021/ja960565o
. [all data]
Hiraoka, Mizuno, et al., 2001
Hiraoka, K.; Mizuno, T.; Iino, T.; Eguchi, D.; Yamabe, S.,
Characteristic changes of bond energies for gas-phase cluster ions of halide ions with methane and chloromethanes,
J. Phys. Chem. A, 2001, 105, 20, 4887-4893, https://doi.org/10.1021/jp010143n
. [all data]
Larson and McMahon, 1984
Larson, J.W.; McMahon, T.B.,
Hydrogen bonding in gas phase anions. An experimental investigation of the interaction between chloride ion and bronsted acids from ICR chloride exchange equilibria,
J. Am. Chem. Soc., 1984, 106, 517. [all data]
Dougherty, Dalton, et al., 1974
Dougherty, R.C.; Dalton, J.; Roberts, J.D.,
SN2 reactions in the gas phase: Structure of the transition state,
Org. Mass Spectrom., 1974, 8, 77. [all data]
Yamdagni and Kebarle, 1971
Yamdagni, R.; Kebarle, P.,
Hydrogen bonding energies to negative ions from gas phase measurements of ionic equilibria,
J. Am. Chem. Soc., 1971, 93, 7139. [all data]
Larson and McMahon, 1984, 2
Larson, J.W.; McMahon, T.B.,
Gas phase negative ion chemistry of alkylchloroformates,
Can. J. Chem., 1984, 62, 675. [all data]
French, Ikuta, et al., 1982
French, M.A.; Ikuta, S.; Kebarle, P.,
Hydrogen bonding of O-H and C-H hydrogen donors to Cl-. Results from mass spectrometric measurement of the ion-molecule equilibria RH + Cl- = RHCl-,
Can. J. Chem., 1982, 60, 1907. [all data]
Hierl, Henchman, et al., 1992
Hierl, P.M.; Henchman, M.J.; Paulson, J.F.,
Threshold Energies for the Reactions HO- + MeX - MeOH + X- measured by Tandem Mass Spectrometry: Acidities of MeCl and MeBr,
Int. J. Mass Spectrom. Ion Proc., 1992, 117, 475, https://doi.org/10.1016/0168-1176(92)80109-E
. [all data]
Ingemann and Nibbering, 1985
Ingemann, S.; Nibbering, N.M.M.,
Gas-phase acidity of CH3X [X = P(CH3)2, SCH3, F, Cl, Br, I] compounds,
J. Chem. Soc. Perkin Trans. 2, 1985, 837. [all data]
Rogers, Simpson, et al., 2010
Rogers, N.J.; Simpson, M.J.; Tuckett, R.P.; Dunn, K.F.; Latimer, C.J.,
Vacuum-UV negative photoion spectroscopy of CH3F, CH3Cl and CH3Br,
Phys. Chem. Chem. Phys., 2010, 12, 36, 10971-10980, https://doi.org/10.1039/c0cp00234h
. [all data]
Poutsma, Nash, et al., 1997
Poutsma, J.C.; Nash, J.J.; Paulino, J.A.; Squires, R.R.,
Absolute Heats of Formation of Phenylcarbene and Vinylcarbene,
J. Am. Chem. Soc., 1997, 119, 20, 4686, https://doi.org/10.1021/ja963918s
. [all data]
Henchman, Hierl, et al., 1985
Henchman, M.; Hierl, P.M.; Paulson, J.F.,
Nucleophilic displacement vs. proton tranfer: The system OH-.(H2O)0,1,2 + CH3Cl in the relative energy range 0.03-5 eV,
J. Am. Chem. Soc., 1985, 107, 2812. [all data]
Luczynski, Malicki, et al., 1974
Luczynski, Z.; Malicki, W.; Wincel, H.,
Positive Ion Reactions of Methyl Cloride in the Gas Phase,
Int. J. Mass Spectrom. Ion Phys., 1974, 15, 3, 321, https://doi.org/10.1016/0020-7381(74)85009-6
. [all data]
Sen Sharma and Kebarle, 1978
Sen Sharma, D.K.; Kebarle, P.,
Binding Energies and Stabilities of Chloronium Ions from Study of the Gas - Phase Equilibria: R1+ + ClR2 = R1ClR2+,
J. Am. Chem. Soc., 1978, 100, 18, 5826, https://doi.org/10.1021/ja00486a039
. [all data]
McMahon, Heinis, et al., 1988
McMahon, T.; Heinis, T.; Nicol, G.; Hovey, J.K.; Kebarle, P.,
Methyl Cation Affinities,
J. Am. Chem. Soc., 1988, 110, 23, 7591, https://doi.org/10.1021/ja00231a002
. [all data]
Foster, Williamson, et al., 1974
Foster, M.S.; Williamson, A.D.; Beauchamp, J.L.,
Photoionization mass spectrometry of trans-azomethane,
Int. J. Mass Spectrom. Ion Phys., 1974, 15, 429. [all data]
Staley and Beauchamp, 1975
Staley, R.H.; Beauchamp, J.L.,
Intrinsic Acid - Base Properties of Molecules. Binding Energies of Li+ to pi - and n - Donor Bases,
J. Am. Chem. Soc., 1975, 97, 20, 5920, https://doi.org/10.1021/ja00853a050
. [all data]
Dzidic and Kebarle, 1970
Dzidic, I.; Kebarle, P.,
Hydration of the Alkali Ions in the Gas Phase. Enthalpies and Entropies of Reactions M+(H2O)n-1 + H2O = M+(H2O)n,
J. Phys. Chem., 1970, 74, 7, 1466, https://doi.org/10.1021/j100702a013
. [all data]
Sharma, Meza de Hojer, et al., 1985
Sharma, D.M.S.; Meza de Hojer, S.; Kebarle, P.,
Stabilities of halonium ions from a study of gas-phase equilibria R+ + XR' = (RXR')+,
J. Am. Chem. Soc., 1985, 107, 13, 3757, https://doi.org/10.1021/ja00299a002
. [all data]
Meot-Ner, 1984
Meot-Ner, (Mautner)M.,
The Ionic Hydrogen Bond and Ion Solvation. 1. -NH+ O-, -NH+ N- and -OH+ O- Bonds. Correlations with Proton Affinity. Deviations Due to Structural Effects,
J. Am. Chem. Soc., 1984, 106, 5, 1257, https://doi.org/10.1021/ja00317a015
. [all data]
Gossett, 1987
Gossett, J.M.,
Measurement of Henry's Law Constants for C1 and C2 Chlorinated Hydrocarbons,
Environ. Sci. Technol., 1987, 21, 202-208. [all data]
Pearson and McConnell, 1975
Pearson, C.R.; McConnell, G.,
Chlorinated C1 and C2 Hydrocarbons in the Marine Environment,
Proc. R. Soc. London, B, 1975, 189, 305-332. [all data]
Pacáková, Vojtechová, et al., 1988
Pacáková, V.; Vojtechová, H.; Coufal, P.,
Reaction gas chromatography: study of the photodecomposition of halogenated hydrocarbons,
Chromatographia, 1988, 25, 7, 621-626, https://doi.org/10.1007/BF02327659
. [all data]
Hively and Hinton, 1968
Hively, R.A.; Hinton, R.E.,
Variation of the retention index with temperature on squalane substrates,
J. Gas Chromatogr., 1968, 6, 4, 203-217, https://doi.org/10.1093/chromsci/6.4.203
. [all data]
White, Douglas, et al., 1992
White, C.M.; Douglas, L.J.; Hackett, J.P.; Anderson, R.R.,
Characterization of synthetic gasoline from the chloromethane-zeolite reaction,
Energy Fuels, 1992, 6, 1, 76-82, https://doi.org/10.1021/ef00031a012
. [all data]
Zenkevich, 2005
Zenkevich, I.G.,
Experimentally measured retention indices., 2005. [all data]
Zenkevich, Eliseenkov, et al., 2006
Zenkevich, I.G.; Eliseenkov, E.V.; Kasatochkin, A.N.,
Application of Retention Indices in GC-MS Identification of Halogenated Organic Compounds,
Mass Spectromery (Rus.), 2006, 3, 2, 131-140. [all data]
Blunden, Aneja, et al., 2005
Blunden, J.; Aneja, V.P.; Lonneman, W.A.,
Characterization of non-methane volatile organic compounds at swine facilities in eastern North Carolina,
Atm. Environ., 2005, 39, 36, 6707-6718, https://doi.org/10.1016/j.atmosenv.2005.03.053
. [all data]
Zenkevich, 1999
Zenkevich, I.G.,
Mutual Correlation between Gas-Chromatographic Retention Indices of Organic Compounds from Different Series,
Zh. Anal. Khim., 1999, 54, 12, 1272-1279. [all data]
Zenkevich, 1998
Zenkevich, I.G.,
Reciprocally Unambiguous Conformity Between GC Retention Indices and Boiling Points within Two- and Multidimensional Taxonomic Groups of Organic Compounds,
J. Hi. Res. Chromatogr., 1998, 21, 10, 565-568, https://doi.org/10.1002/(SICI)1521-4168(19981001)21:10<565::AID-JHRC565>3.0.CO;2-6
. [all data]
Zenkevich and Chupalov, 1996
Zenkevich, I.G.; Chupalov, A.A.,
New Possibilities of Chromato Mass Pectrometric Identification of Organic Compounds Using Increments of Gas Chromatographic Retention Indices of Molecular Structural Fragments,
Zh. Org. Khim. (Rus.), 1996, 32, 5, 656-666. [all data]