(S)-2,3-dimethylpentane
- Formula: C7H16
- Molecular weight: 100.2019
- IUPAC Standard InChIKey: WGECXQBGLLYSFP-SSDOTTSWSA-N
- CAS Registry Number: 7485-45-2
- Chemical structure:
View 3d structure (requires JavaScript / HTML 5) - Stereoisomers:

Phase change data

Data compiled by: Thermodynamics Research Center, NIST Boulder Laboratories, Chris Muzny director
Quantity | Value | Units | Method | Reference | Comment |
---|---|---|---|---|---|
Tboil | 363. | K | N/A | Tsuda, Hayatsu, et al., 1959 | Uncertainty assigned by TRC = 3. K |

References

Tsuda, Hayatsu, et al., 1959
Tsuda, K.; Hayatsu, R.; Kishida, Y.,
Absolute Configuration of C-(24) Ethyl of Stigmasterol,
Chem. Ind. (London), 1959, 1959, 1411-2. [all data]