Ethane
- Formula: C2H6
- Molecular weight: 30.0690
- IUPAC Standard InChIKey: OTMSDBZUPAUEDD-UHFFFAOYSA-N
- CAS Registry Number: 74-84-0
- Chemical structure:
View 3d structure (requires JavaScript / HTML 5) - Species with the same structure:
- Isotopologues:
- Other names: Bimethyl; Dimethyl; Ethyl hydride; Methylmethane; C2H6; UN 1035; UN 1961

Gas phase thermochemistry data

Data compiled as indicated in comments:
DRB - Donald R. Burgess, Jr.
ALS - Hussein Y. Afeefy, Joel F. Liebman, and Stephen E. Stein
GT - Glushko Thermocenter, Russian Academy of Sciences, Moscow
Quantity | Value | Units | Method | Reference | Comment |
---|---|---|---|---|---|
ΔfH°gas | -84. ± 0.4 | kJ/mol | Review | Manion, 2002 | adopted recommendation of Gurvich, Veyts, et al., 1991; DRB |
ΔfH°gas | -83.8 ± 0.3 | kJ/mol | Ccb | Pittam and Pilcher, 1972 | ALS |
ΔfH°gas | -84.67 ± 0.49 | kJ/mol | Ccb | Prosen and Rossini, 1945 | Hf derived from Heat of Hydrogenation; ALS |
Quantity | Value | Units | Method | Reference | Comment |
ΔcH°gas | -1560.7 ± 0.3 | kJ/mol | Ccb | Pittam and Pilcher, 1972 | Corresponding ΔfHºgas = -83.85 kJ/mol (simple calculation by NIST; no Washburn corrections); ALS |
ΔcH°gas | -1559.9 ± 0.46 | kJ/mol | Ccb | Prosen and Rossini, 1945 | Hf derived from Heat of Hydrogenation; Corresponding ΔfHºgas = -84.64 kJ/mol (simple calculation by NIST; no Washburn corrections); ALS |
ΔcH°gas | -1559.8 ± 0.46 | kJ/mol | Ccb | Rossini, 1934 | Corresponding ΔfHºgas = -84.68 kJ/mol (simple calculation by NIST; no Washburn corrections); ALS |
Constant pressure heat capacity of gas
Cp,gas (J/mol*K) | Temperature (K) | Reference | Comment |
---|---|---|---|
35.70 | 100. | Gurvich, Veyts, et al., 1989 | p=1 bar. Recommended entropies and heat capacities are in good agreement with those obtained from other statistical thermodynamic calculations [ Pitzer K.S., 1944, Chao J., 1973, Pamidimukkala K.M., 1982].; GT |
42.30 | 200. | ||
52.49 | 298.15 | ||
52.71 | 300. | ||
65.46 | 400. | ||
77.94 | 500. | ||
89.19 | 600. | ||
99.14 | 700. | ||
107.94 | 800. | ||
115.71 | 900. | ||
122.55 | 1000. | ||
128.55 | 1100. | ||
133.80 | 1200. | ||
138.39 | 1300. | ||
142.40 | 1400. | ||
145.90 | 1500. | ||
148.98 | 1600. | ||
151.67 | 1700. | ||
154.04 | 1800. | ||
156.14 | 1900. | ||
158.00 | 2000. | ||
159.65 | 2100. | ||
161.12 | 2200. | ||
162.43 | 2300. | ||
163.61 | 2400. | ||
164.67 | 2500. | ||
165.63 | 2600. | ||
166.49 | 2700. | ||
167.28 | 2800. | ||
168.00 | 2900. | ||
168.65 | 3000. |
Constant pressure heat capacity of gas
Cp,gas (J/mol*K) | Temperature (K) | Reference | Comment |
---|---|---|---|
41.66 ± 0.31 | 189.20 | Halford J.O., 1957 | Please also see Eucken A., 1933, Kistiakowsky G.B., 1939, Dailey B.P., 1943.; GT |
43.25 ± 0.32 | 209.30 | ||
45.08 ± 0.34 | 229.65 | ||
47.27 ± 0.35 | 249.90 | ||
47.17 ± 0.35 | 250.15 | ||
49.68 ± 0.37 | 272.00 | ||
49.51 ± 0.04 | 272.07 | ||
50.66 ± 0.42 | 279.00 | ||
52.14 ± 0.39 | 292.00 | ||
53.27 ± 0.07 | 302.70 | ||
57.40 ± 0.04 | 335.82 | ||
58.91 | 347.65 | ||
60.38 | 359.75 | ||
61.04 ± 0.10 | 364.78 | ||
62.10 ± 0.47 | 373.60 | ||
63.89 | 387.55 | ||
72.43 | 451.95 | ||
80.08 | 520.55 | ||
86.27 | 561.65 | ||
90.46 | 603.25 |

Condensed phase thermochemistry data

Data compiled by: Eugene S. Domalski and Elizabeth D. Hearing
Quantity | Value | Units | Method | Reference | Comment |
---|---|---|---|---|---|
S°liquid | 126.7 | J/mol*K | N/A | Witt and Kemp, 1937 | Entropy from 0 to 15 K calculated using a Debye function. |
Constant pressure heat capacity of liquid
Cp,liquid (J/mol*K) | Temperature (K) | Reference | Comment |
---|---|---|---|
68.66 | 100. | Atake and Chihara, 1976 | T = 50 to 100 K. Data given graphically. Cp = 0.69933 (T/K) - 2.385 J/mol*K (50 to 70 K, for solid). |
68.5 | 94. | Roder, 1976 | From data 90.3 to 94 K. Average value over range. |
68.44 | 100.32 | Roder, 1976, 2 | T = 93 to 301 K (saturation line), 91 to 330 K, pressures from 0 to 33 MPa. |
72.22 | 180. | Witt and Kemp, 1937 | T = 15 to 185 K. |
74.48 | 200. | Wiebe, Hubbard, et al., 1930 | T = 67 to 305.2 K. Heat capacity of saturated liquid given to 295 K is 136.1 J/mol*K. |

Phase change data

Data compiled as indicated in comments:
DH - Eugene S. Domalski and Elizabeth D. Hearing
TRC - Thermodynamics Research Center, NIST Boulder Laboratories, Chris Muzny director
AC - William E. Acree, Jr., James S. Chickos
Quantity | Value | Units | Method | Reference | Comment |
---|---|---|---|---|---|
Tboil | 184.6 ± 0.6 | K | AVG | N/A | Average of 23 values; Individual data points |
Quantity | Value | Units | Method | Reference | Comment |
Tfus | 101. | K | N/A | Streng, 1971 | Uncertainty assigned by TRC = 1. K; TRC |
Tfus | 89.2 | K | N/A | Timmermans, 1935 | Uncertainty assigned by TRC = 1.5 K; TRC |
Quantity | Value | Units | Method | Reference | Comment |
Ttriple | 91. ± 6. | K | AVG | N/A | Average of 10 values; Individual data points |
Quantity | Value | Units | Method | Reference | Comment |
Ptriple | 0.000011 | bar | N/A | Younglove and Ely, 1987 | Uncertainty assigned by TRC = 5.×10-9 bar; TRC |
Quantity | Value | Units | Method | Reference | Comment |
Tc | 305.3 ± 0.3 | K | AVG | N/A | Average of 41 out of 46 values; Individual data points |
Quantity | Value | Units | Method | Reference | Comment |
Pc | 49. ± 1. | bar | AVG | N/A | Average of 28 out of 29 values; Individual data points |
Quantity | Value | Units | Method | Reference | Comment |
Vc | 0.147 ± 0.002 | l/mol | AVG | N/A | Average of 6 values; Individual data points |
Quantity | Value | Units | Method | Reference | Comment |
ρc | 6.9 ± 0.4 | mol/l | AVG | N/A | Average of 19 values; Individual data points |
Quantity | Value | Units | Method | Reference | Comment |
ΔvapH° | 9.76 | kJ/mol | N/A | Majer and Svoboda, 1985 |
Enthalpy of vaporization
ΔvapH (kJ/mol) | Temperature (K) | Method | Reference | Comment |
---|---|---|---|---|
14.703 | 184.1 | N/A | Witt and Kemp, 1937 | DH |
15.3 | 288. | A | Stephenson and Malanowski, 1987 | Based on data from 273. to 305. K.; AC |
15.7 | 170. | A | Stephenson and Malanowski, 1987 | Based on data from 154. to 185. K.; AC |
17.7 | 114. | A | Stephenson and Malanowski, 1987 | Based on data from 95. to 129. K.; AC |
14.9 | 214. | A | Stephenson and Malanowski, 1987 | Based on data from 185. to 229. K.; AC |
14.9 | 259. | A | Stephenson and Malanowski, 1987 | Based on data from 228. to 274. K.; AC |
17.1 | 129. | N/A | Carruth and Kobayashi, 1973 | Based on data from 91. to 144. K.; AC |
14.7 | 210. | N/A | Reid, 1972 | AC |
14.7 | 184. | N/A | Witt and Kemp, 1937 | AC |
15.3 | 185. | N/A | Loomis and Walters, 1926 | Based on data from 136. to 200. K.; AC |
Enthalpy of vaporization
ΔvapH =
A exp(-βTr) (1 − Tr)β
ΔvapH =
Enthalpy of vaporization (at saturation pressure)
(kJ/mol)
Tr = reduced temperature (T / Tc)
View plot Requires a JavaScript / HTML 5 canvas capable browser.
Temperature (K) | A (kJ/mol) | β | Tc (K) | Reference |
---|---|---|---|---|
289. to 301. | 29.43 | 0.3696 | 305.4 | Majer and Svoboda, 1985 |
Entropy of vaporization
ΔvapS (J/mol*K) | Temperature (K) | Reference | Comment |
---|---|---|---|
79.87 | 184.1 | Witt and Kemp, 1937 | DH |
Antoine Equation Parameters
log10(P) = A − (B / (T + C))
P = vapor pressure (bar)
T = temperature (K)
View plot Requires a JavaScript / HTML 5 canvas capable browser.
Temperature (K) | A | B | C | Reference | Comment |
---|---|---|---|---|---|
91.33 to 144.13 | 4.50706 | 791.3 | -6.422 | Carruth and Kobayashi, 1973 | Coefficents calculated by NIST from author's data. |
135.74 to 199.91 | 3.93835 | 659.739 | -16.719 | Loomis and Walters, 1926 | Coefficents calculated by NIST from author's data. |
Enthalpy of sublimation
ΔsubH (kJ/mol) | Temperature (K) | Method | Reference | Comment |
---|---|---|---|---|
22.6 | 85. | N/A | Regnier, 1972 | Based on data from 80. to 90. K.; AC |
20.5 | 90. | B | Bondi, 1963 | AC |
Enthalpy of fusion
ΔfusH (kJ/mol) | Temperature (K) | Reference | Comment |
---|---|---|---|
0.583 | 90.341 | Atake and Chihara, 1976 | Triple point.; DH |
2.79 | 89.5 | Domalski and Hearing, 1996 | AC |
0.58 | 90.3 | Atake and Chihara, 1976 | AC |
Entropy of fusion
ΔfusS (J/mol*K) | Temperature (K) | Reference | Comment |
---|---|---|---|
6.46 | 90.341 | Atake and Chihara, 1976 | Triple; DH |
Enthalpy of phase transition
ΔHtrs (kJ/mol) | Temperature (K) | Initial Phase | Final Phase | Reference | Comment |
---|---|---|---|---|---|
2.282 | 89.813 | crystaline, II | crystaline, I | Atake and Chihara, 1976 | DH |
2.857 | 89.87 | crystaline, I | liquid | Witt and Kemp, 1937 | DH |
2.793 | 89.50 | crystaline, I | liquid | Wiebe, Hubbard, et al., 1930 | DH |
2.4375 | 89.77 | crystaline, II | crystaline, I | Roder, 1976 | DH |
Entropy of phase transition
ΔStrs (J/mol*K) | Temperature (K) | Initial Phase | Final Phase | Reference | Comment |
---|---|---|---|---|---|
25.48 | 89.813 | crystaline, II | crystaline, I | Atake and Chihara, 1976 | DH |
31.8 | 89.87 | crystaline, I | liquid | Witt and Kemp, 1937 | DH |
31.2 | 89.50 | crystaline, I | liquid | Wiebe, Hubbard, et al., 1930 | DH |
27.15 | 89.77 | crystaline, II | crystaline, I | Roder, 1976 | DH |

Reaction thermochemistry data

Data compiled as indicated in comments:
M - Michael M. Meot-Ner (Mautner) and Sharon G. Lias
MS - José A. Martinho Simões
B - John E. Bartmess
ALS - Hussein Y. Afeefy, Joel F. Liebman, and Stephen E. Stein
RCD - Robert C. Dunbar
Individual Reactions
By formula: Co+ + C2H6 = (Co+ • C2H6)
Quantity | Value | Units | Method | Reference | Comment |
---|---|---|---|---|---|
ΔrS° | 93.3 | J/mol*K | SIDT | Kemper, Bushnell, et al., 1993 | gas phase; switching reaction(Co+)CH4, ΔrS(500 K); M |
Enthalpy of reaction
ΔrH° (kJ/mol) | T (K) | Method | Reference | Comment |
---|---|---|---|---|
100. (+5.0,-0.) | CID | Armentrout and Kickel, 1994 | gas phase; guided ion beam CID; M | |
117. (+6.7,-0.) | SIDT | Kemper, Bushnell, et al., 1993 | gas phase; switching reaction(Co+)CH4, ΔrS(500 K); M |
By formula: (Co+ • CH4) + C2H6 = (Co+ • C2H6 • CH4)
Quantity | Value | Units | Method | Reference | Comment |
---|---|---|---|---|---|
ΔrS° | 108. | J/mol*K | SIDT | Kemper, Bushnell, et al., 1993 | gas phase; switching reaction(Co+).2CH4, ΔrS(480 K); M |
Enthalpy of reaction
ΔrH° (kJ/mol) | T (K) | Method | Reference | Comment |
---|---|---|---|---|
119. (+5.4,-0.) | SIDT | Kemper, Bushnell, et al., 1993 | gas phase; switching reaction(Co+).2CH4, ΔrS(480 K); M |
3 (g) +
(l) = AlH3O3 (amorphous) + 3
(g)
By formula: 3H2O (g) + C6H15Al (l) = AlH3O3 (amorphous) + 3C2H6 (g)
Quantity | Value | Units | Method | Reference | Comment |
---|---|---|---|---|---|
ΔrH° | -647.3 ± 6.3 | kJ/mol | RSC | Fowell, 1961 | Please also see Cox and Pilcher, 1970. Liquid triethylaluminum contains a very small molar fraction of monomer at 298 K, ca. 0.1% Smith, 1967, so that the "real" liquid should be described as [Al(Et)3]2.; MS |
C2H5- + =
Quantity | Value | Units | Method | Reference | Comment |
---|---|---|---|---|---|
ΔrH° | 1758. ± 8.4 | kJ/mol | Bran | DePuy, Gronert, et al., 1989 | gas phase; B |
ΔrH° | 1761. ± 8.4 | kJ/mol | Bran | DePuy, Bierbaum, et al., 1984 | gas phase; B |
Quantity | Value | Units | Method | Reference | Comment |
ΔrG° | 1723. ± 8.8 | kJ/mol | H-TS | DePuy, Gronert, et al., 1989 | gas phase; B |
By formula: (Co+ • C2H6) + CH4 = (Co+ • CH4 • C2H6)
Quantity | Value | Units | Method | Reference | Comment |
---|---|---|---|---|---|
ΔrS° | 110. | J/mol*K | SIDT | Kemper, Bushnell, et al., 1993 | gas phase; ΔrS(490 K); M |
Enthalpy of reaction
ΔrH° (kJ/mol) | T (K) | Method | Reference | Comment |
---|---|---|---|---|
102. (+4.6,-0.) | SIDT | Kemper, Bushnell, et al., 1993 | gas phase; ΔrS(490 K); M |
By formula: HBr (g) + C2H5Li (cr) = C2H6 (g) + BrLi (cr)
Quantity | Value | Units | Method | Reference | Comment |
---|---|---|---|---|---|
ΔrH° | -345.7 ± 2.0 | kJ/mol | RSC | Holm, 1974 | Please also see Pedley and Rylance, 1977. The reaction enthalpy was quoted from Pedley and Rylance, 1977. See Liebman, Martinho Simões, et al., 1995 for comments; MS |
By formula: C5O5W (g) + C2H6 (g) = C7H6O5W (g)
Quantity | Value | Units | Method | Reference | Comment |
---|---|---|---|---|---|
ΔrH° | -31.0 ± 8.4 | kJ/mol | EqG | Brown, Ishikawa, et al., 1990 | Temperature range: ca. 300-350 K; MS |
ΔrH° | -41. ± 13. | kJ/mol | EqG | Ishikawa, Brown, et al., 1988 | Temperature range: 298-363 K; MS |
By formula: Fe+ + C2H6 = (Fe+ • C2H6)
Quantity | Value | Units | Method | Reference | Comment |
---|---|---|---|---|---|
ΔrH° | 70. ± 10. | kJ/mol | MKER | Carpenter, van Koppen, et al., 1995 | gas phase; M |
Enthalpy of reaction
ΔrH° (kJ/mol) | T (K) | Method | Reference | Comment |
---|---|---|---|---|
64.0 (+5.9,-0.) | CID | Armentrout and Kickel, 1994 | gas phase; guided ion beam CID; M |
By formula: C2H4Cl2 + 2H2 = C2H6 + 2HCl
Quantity | Value | Units | Method | Reference | Comment |
---|---|---|---|---|---|
ΔrH° | -143.0 ± 0.96 | kJ/mol | Chyd | Lacher, Amador, et al., 1967 | gas phase; Reanalyzed by Cox and Pilcher, 1970, 2, Original value = -147.77 ± 0.50 kJ/mol; At 250 C; ALS |
By formula: 2H2 + C2H4Cl2 = C2H6 + 2HCl
Quantity | Value | Units | Method | Reference | Comment |
---|---|---|---|---|---|
ΔrH° | -140.8 ± 1.0 | kJ/mol | Chyd | Lacher, Amador, et al., 1967 | gas phase; Reanalyzed by Cox and Pilcher, 1970, 2, Original value = -145.0 ± 0.50 kJ/mol; At 250C; ALS |
Quantity | Value | Units | Method | Reference | Comment |
---|---|---|---|---|---|
ΔrH° | -312.0 ± 0.63 | kJ/mol | Chyd | Conn, Kistiakowsky, et al., 1939 | gas phase; Reanalyzed by Cox and Pilcher, 1970, 2, Original value = -314.1 ± 2.8 kJ/mol; At 355 K; ALS |
(l) + (
• 100
) (solution) = 2
(g) + (
• 100
) (solution)
By formula: C4H10Zn (l) + (H2O4S • 100H2O) (solution) = 2C2H6 (g) + (O4SZn • 100H2O) (solution)
Quantity | Value | Units | Method | Reference | Comment |
---|---|---|---|---|---|
ΔrH° | -354.4 ± 4.2 | kJ/mol | RSC | Carson, Hartley, et al., 1949 | Please also see Pedley and Rylance, 1977 and Cox and Pilcher, 1970.; MS |
Quantity | Value | Units | Method | Reference | Comment |
---|---|---|---|---|---|
ΔrH° | -136. ± 2. | kJ/mol | Chyd | Kistiakowsky and Nickle, 1951 | gas phase; ALS |
ΔrH° | -136.3 ± 0.3 | kJ/mol | Chyd | Kistiakowsky, Romeyn, et al., 1935 | gas phase; ALS |
2 (g) +
(l) = AlCl3 (cr) + 2
(g)
By formula: 2HCl (g) + C4H10AlCl (l) = AlCl3 (cr) + 2C2H6 (g)
Quantity | Value | Units | Method | Reference | Comment |
---|---|---|---|---|---|
ΔrH° | -265.0 ± 3.3 | kJ/mol | RSC | Shaulov and Shmyreva, 1968 | The reaction enthalpy was derived from data in Shaulov and Shmyreva, 1968.; MS |
By formula: C2H4+ + C2H6 = (C2H4+ • C2H6)
Quantity | Value | Units | Method | Reference | Comment |
---|---|---|---|---|---|
ΔrH° | 64.0 | kJ/mol | PHPMS | Hiraoka and Kebarle, 1980 | gas phase; M |
Quantity | Value | Units | Method | Reference | Comment |
ΔrS° | 88. | J/mol*K | PHPMS | Hiraoka and Kebarle, 1980 | gas phase; M |
By formula: 2H2 + C2H3Cl = C2H6 + HCl
Quantity | Value | Units | Method | Reference | Comment |
---|---|---|---|---|---|
ΔrH° | -214.2 ± 0.8 | kJ/mol | Chyd | Lacher, Emery, et al., 1956 | gas phase; At 298 K, see Lacher, Kianpour, et al., 1956; ALS |
(g) + C2H5BrMg (solution) =
(solution) + Br2Mg (solution)
By formula: HBr (g) + C2H5BrMg (solution) = C2H6 (solution) + Br2Mg (solution)
Quantity | Value | Units | Method | Reference | Comment |
---|---|---|---|---|---|
ΔrH° | -299.2 ± 2.2 | kJ/mol | RSC | Holm, 1981 | solvent: Diethyl ether; MS |
By formula: (Co+ • 2C2H6) + C2H6 = (Co+ • 3C2H6)
Quantity | Value | Units | Method | Reference | Comment |
---|---|---|---|---|---|
ΔrH° | 50. | kJ/mol | SIDT | Kemper, Bushnell, et al., 1993 | gas phase; ΔrH<; M |
By formula: Al+ + C2H6 = (Al+ • C2H6)
Quantity | Value | Units | Method | Reference | Comment |
---|---|---|---|---|---|
ΔrH° | 38. ± 8.4 | kJ/mol | CIDC,EqG | Stockigt, Schwarz, et al., 1996 | Anchored to theory; RCD |
By formula: 2H2 + C2H3Br = HBr + C2H6
Quantity | Value | Units | Method | Reference | Comment |
---|---|---|---|---|---|
ΔrH° | -199.2 ± 1.9 | kJ/mol | Chyd | Lacher, Kianpour, et al., 1957 | gas phase; ALS |
By formula: H2 + 2C2H5I = 2C2H6 + I2
Quantity | Value | Units | Method | Reference | Comment |
---|---|---|---|---|---|
ΔrH° | -88.7 ± 3.3 | kJ/mol | Chyd | Ashcroft, Carson, et al., 1965 | liquid phase; ALS |
By formula: H2 + C2H5Br = HBr + C2H6
Quantity | Value | Units | Method | Reference | Comment |
---|---|---|---|---|---|
ΔrH° | -59.0 ± 1.1 | kJ/mol | Chyd | Fowell, Lacher, et al., 1965 | gas phase; ALS |
By formula: H2 + 2C2H5Br = 2C2H6 + Br2
Quantity | Value | Units | Method | Reference | Comment |
---|---|---|---|---|---|
ΔrH° | 23. ± 13. | kJ/mol | Chyd | Ashcroft, Carson, et al., 1965 | liquid phase; ALS |
By formula: H2 + C2H5Cl = C2H6 + HCl
Quantity | Value | Units | Method | Reference | Comment |
---|---|---|---|---|---|
ΔrH° | -69.3 ± 0.4 | kJ/mol | Chyd | Lacher, Emery, et al., 1956 | gas phase; ALS |
By formula: Ni+ + C2H6 = (Ni+ • C2H6)
Quantity | Value | Units | Method | Reference | Comment |
---|---|---|---|---|---|
ΔrH° | 120. ± 10. | kJ/mol | MKER | Carpenter, van Koppen, et al., 1995 | gas phase; M |

Henry's Law data

Data compiled by: Rolf Sander
Henry's Law constant (water solution)
kH(T) = k°H exp(d(ln(kH))/d(1/T) ((1/T) - 1/(298.15 K)))
k°H = Henry's law constant for solubility in water at 298.15 K (mol/(kg*bar))
d(ln(kH))/d(1/T) = Temperature dependence constant (K)
k°H (mol/(kg*bar)) | d(ln(kH))/d(1/T) (K) | Method | Reference | Comment |
---|---|---|---|---|
0.0019 | 2300. | L | N/A | |
0.0020 | Q | N/A | missing citation give several references for the Henry's law constants but don't assign them to specific species. | |
0.0020 | L | N/A | ||
0.0018 | 2400. | L | N/A | |
0.0020 | V | N/A | ||
0.011 | V | N/A |

Vibrational and/or electronic energy levels

Data compiled by: Takehiko Shimanouchi
Symmetry: D3d Symmetry Number σ = 6
Sym. | No | Approximate | Selected Freq. | Infrared | Raman | Comments | ||||
---|---|---|---|---|---|---|---|---|---|---|
Species | type of mode | Value | Rating | Value | Phase | Value | Phase | |||
a1g | 1 | CH3 s-str | 2954 | B | ia | 2953.7 | gas | |||
a1g | 2 | CH3 s-deform | 1388 | B | ia | 1388.4 | gas | |||
a1g | 3 | CC str | 995 | A | ia | 994.8 | gas | |||
a1u | 4 | Torsion | 289 | B | 289 | gas | ia | |||
a2u | 5 | CH3 s-str | 2896 | B | 2895.8 | gas | ia | |||
a2u | 6 | CH3 s-deform | 1379 | A | 1379.2 | gas | ia | |||
eg | 7 | CH3 d-str | 2969 | A | ia | 2968.7 | gas | |||
eg | 8 | CH3 d-deform | 1468 | A | ia | 1468.1 | gas | |||
eg | 9 | CH3 rock | 1190 | E | ia | OC | ||||
eu | 10 | CH3 d-str | 2985 | A | 2985.4 | gas | ia | |||
eu | 11 | CH3 d-deform | 1469 | C | 1469 | gas | ia | FR(ν4+ν12) | ||
eu | 12 | CH3 rock | 822 | A | 821.6 | gas | ia | |||
Source: Shimanouchi, 1972

Gas phase ion energetics data

Data evaluated as indicated in comments:
HL - Edward P. Hunter and Sharon G. Lias
L - Sharon G. Lias
Data compiled as indicated in comments:
B - John E. Bartmess
LL - Sharon G. Lias and Joel F. Liebman
LBLHLM - Sharon G. Lias, John E. Bartmess, Joel F. Liebman, John L. Holmes, Rhoda D. Levin, and W. Gary Mallard
LLK - Sharon G. Lias, Rhoda D. Levin, and Sherif A. Kafafi
RDSH - Henry M. Rosenstock, Keith Draxl, Bruce W. Steiner, and John T. Herron
Quantity | Value | Units | Method | Reference | Comment |
---|---|---|---|---|---|
IE (evaluated) | 11.52 ± 0.04 | eV | N/A | N/A | L |
Quantity | Value | Units | Method | Reference | Comment |
Proton affinity (review) | 142.5 | kcal/mol | N/A | Hunter and Lias, 1998 | HL |
Quantity | Value | Units | Method | Reference | Comment |
Gas basicity | 136.2 | kcal/mol | N/A | Hunter and Lias, 1998 | HL |
Ionization energy determinations
IE (eV) | Method | Reference | Comment |
---|---|---|---|
11. ± 1. | PI | Au, Cooper, et al., 1993 | LL |
11.52 | EST | Luo and Pacey, 1992 | LL |
11.57 | EI | Plessis and Marmet, 1987 | LBLHLM |
11.56 ± 0.02 | EI | Plessis and Marmet, 1987, 2 | LBLHLM |
11.4 ± 0.4 | EI | Chatham, Hils, et al., 1984 | LBLHLM |
11.5 ± 0.1 | EI | Suzuki and Maeda, 1977 | LLK |
11.56 ± 0.02 | PE | Bieri, Burger, et al., 1977 | LLK |
11.76 ± 0.05 | EI | Flesch and Svec, 1973 | LLK |
11.45 ± 0.05 | TE | Stockbauer and Inghram, 1971 | LLK |
11.51 | PE | Dewar and Worley, 1969 | RDSH |
11.66 ± 0.05 | EI | Williams and Hamill, 1968 | RDSH |
11.55 | CI | Cermak, 1968 | RDSH |
11.56 | PE | Baker, Baker, et al., 1968 | RDSH |
11.521 ± 0.007 | PI | Nicholson, 1965 | RDSH |
11.99 | PE | Kimura, Katsumata, et al., 1981 | Vertical value; LLK |
12.0 | PE | Bieri and Asbrink, 1980 | Vertical value; LLK |
12.1 ± 0.1 | PE | Bieri, Burger, et al., 1977 | Vertical value; LLK |
12.00 | PE | Doucet, Sauvageau, et al., 1975 | Vertical value; LLK |
Appearance energy determinations
De-protonation reactions
C2H5- + =
Quantity | Value | Units | Method | Reference | Comment |
---|---|---|---|---|---|
ΔrH° | 420.1 ± 2.0 | kcal/mol | Bran | DePuy, Gronert, et al., 1989 | gas phase; B |
ΔrH° | 421.0 ± 2.0 | kcal/mol | Bran | DePuy, Bierbaum, et al., 1984 | gas phase; B |
Quantity | Value | Units | Method | Reference | Comment |
ΔrG° | 411.7 ± 2.1 | kcal/mol | H-TS | DePuy, Gronert, et al., 1989 | gas phase; B |

Ion clustering data

Data compiled as indicated in comments:
RCD - Robert C. Dunbar
M - Michael M. Meot-Ner (Mautner) and Sharon G. Lias
Clustering reactions
By formula: Al+ + C2H6 = (Al+ • C2H6)
Quantity | Value | Units | Method | Reference | Comment |
---|---|---|---|---|---|
ΔrH° | 9.0 ± 2.0 | kcal/mol | CIDC,EqG | Stockigt, Schwarz, et al., 1996 | Anchored to theory; RCD |
By formula: C2H4+ + C2H6 = (C2H4+ • C2H6)
Quantity | Value | Units | Method | Reference | Comment |
---|---|---|---|---|---|
ΔrH° | 15.3 | kcal/mol | PHPMS | Hiraoka and Kebarle, 1980 | gas phase; M |
Quantity | Value | Units | Method | Reference | Comment |
ΔrS° | 21. | cal/mol*K | PHPMS | Hiraoka and Kebarle, 1980 | gas phase; M |
By formula: (Co+ • CH4) + C2H6 = (Co+ • C2H6 • CH4)
Quantity | Value | Units | Method | Reference | Comment |
---|---|---|---|---|---|
ΔrS° | 25.9 | cal/mol*K | SIDT | Kemper, Bushnell, et al., 1993 | gas phase; switching reaction(Co+).2CH4, ΔrS(480 K); M |
Enthalpy of reaction
ΔrH° (kcal/mol) | T (K) | Method | Reference | Comment |
---|---|---|---|---|
28.4 (+1.3,-0.) | SIDT | Kemper, Bushnell, et al., 1993 | gas phase; switching reaction(Co+).2CH4, ΔrS(480 K); M |
By formula: Co+ + C2H6 = (Co+ • C2H6)
Quantity | Value | Units | Method | Reference | Comment |
---|---|---|---|---|---|
ΔrS° | 22.3 | cal/mol*K | SIDT | Kemper, Bushnell, et al., 1993 | gas phase; switching reaction(Co+)CH4, ΔrS(500 K); M |
Enthalpy of reaction
ΔrH° (kcal/mol) | T (K) | Method | Reference | Comment |
---|---|---|---|---|
23.9 (+1.2,-0.) | CID | Armentrout and Kickel, 1994 | gas phase; guided ion beam CID; M | |
28.0 (+1.6,-0.) | SIDT | Kemper, Bushnell, et al., 1993 | gas phase; switching reaction(Co+)CH4, ΔrS(500 K); M |
By formula: (Co+ • 2C2H6) + C2H6 = (Co+ • 3C2H6)
Quantity | Value | Units | Method | Reference | Comment |
---|---|---|---|---|---|
ΔrH° | 12. | kcal/mol | SIDT | Kemper, Bushnell, et al., 1993 | gas phase; ΔrH<; M |
By formula: Fe+ + C2H6 = (Fe+ • C2H6)
Quantity | Value | Units | Method | Reference | Comment |
---|---|---|---|---|---|
ΔrH° | 18. ± 3. | kcal/mol | MKER | Carpenter, van Koppen, et al., 1995 | gas phase; M |
Enthalpy of reaction
ΔrH° (kcal/mol) | T (K) | Method | Reference | Comment |
---|---|---|---|---|
15.3 (+1.4,-0.) | CID | Armentrout and Kickel, 1994 | gas phase; guided ion beam CID; M |
By formula: Ni+ + C2H6 = (Ni+ • C2H6)
Quantity | Value | Units | Method | Reference | Comment |
---|---|---|---|---|---|
ΔrH° | 29. ± 3. | kcal/mol | MKER | Carpenter, van Koppen, et al., 1995 | gas phase; M |

References

Manion, 2002
Manion, J.A.,
Evaluated Enthalpies of Formation of the Stable Closed Shell C1 and C2 Chlorinated Hydrocarbons,
J. Phys. Chem. Ref. Data, 2002, 31, 1, 123-172, https://doi.org/10.1063/1.1420703
. [all data]
Gurvich, Veyts, et al., 1991
Thermodynamic Properties of Individual Substances, 4th edition, Volume 2, Gurvich, L.V.; Veyts, I.V.; Alcock, C.B.;, ed(s)., Hemisphere, New York, 1991. [all data]
Pittam and Pilcher, 1972
Pittam, D.A.; Pilcher, G.,
Measurements of heats of combustion by flame calorimetry. Part 8.-Methane, ethane, propane, n-butane and 2-methylpropane,
J. Chem. Soc. Faraday Trans. 1, 1972, 68, 2224-2229. [all data]
Prosen and Rossini, 1945
Prosen, E.J.; Rossini, F.D.,
Heats of combustion and formation of the paraffin hydrocarbons at 25° C,
J. Res. NBS, 1945, 263-267. [all data]
Rossini, 1934
Rossini, F.D.,
Calorimetric determination of the heats of combustion of ethane, propane, normal butane, and normal pentane,
J. Res. NBS, 1934, 12, 735-750. [all data]
Gurvich, Veyts, et al., 1989
Gurvich, L.V.; Veyts, I.V.; Alcock, C.B.,
Thermodynamic Properties of Individual Substances, 4th ed.; Vols. 1 and 2, Hemisphere, New York, 1989. [all data]
Pitzer K.S., 1944
Pitzer K.S.,
Thermodynamics of gaseous paraffins. Specific heat and related properties,
Ind. Eng. Chem., 1944, 36, 829-831. [all data]
Chao J., 1973
Chao J.,
Ideal gas thermodynamic properties of ethane and propane,
J. Phys. Chem. Ref. Data, 1973, 2, 427-438. [all data]
Pamidimukkala K.M., 1982
Pamidimukkala K.M.,
Ideal gas thermodynamic properties of CH3, CD3, CD4, C2D2, C2D4, C2D6, C2H6, CH3N2CH3, and CD3N2CD3,
J. Phys. Chem. Ref. Data, 1982, 11, 83-99. [all data]
Halford J.O., 1957
Halford J.O.,
Standard heat capacities of gaseous methanol, ethanol, methane and ethane at 279 K by thermal conductivity,
J. Phys. Chem., 1957, 61, 1536-1539. [all data]
Eucken A., 1933
Eucken A.,
Molar heats and normal frequencies of ethane and ethylene,
Z. Phys. Chem., 1933, B20, 184-194. [all data]
Kistiakowsky G.B., 1939
Kistiakowsky G.B.,
Gaseous heat capacities. I. The method and the heat capacities of C2H6 and C2D6,
J. Chem. Phys., 1939, 7, 281-288. [all data]
Dailey B.P., 1943
Dailey B.P.,
The heat capacities at higher temperatures of ethane and propane,
J. Am. Chem. Soc., 1943, 65, 42-44. [all data]
Witt and Kemp, 1937
Witt, R.K.; Kemp, J.D.,
The heat capacity of ethane from 15°K to the boiling point. The heat of fusion and the heat of vaporization,
J. Am. Chem. Soc., 1937, 59, 273-276. [all data]
Atake and Chihara, 1976
Atake, T.; Chihara, H.,
Calorimetric study of the phase changes in solid ethane,
Chem. Lett., 1976, (7), 683-688. [all data]
Roder, 1976
Roder, H.M.,
The heats of transition of solid ethane,
J. Chem. Phys., 1976, 65, 1371-1373. [all data]
Roder, 1976, 2
Roder, H.M.,
Measurements of the specific heats, Ca, and Cv, of dense gaseous and liquid ethane,
J. Res., 1976, NBS 80A, 739-759. [all data]
Wiebe, Hubbard, et al., 1930
Wiebe, R.; Hubbard, K.H.; Brevoort, M.J.,
The heat capacity of saturated liquid ethane from the boiling point to the critical temperature and heat fusion of the solid,
J. Am. Chem. Soc., 1930, 52, 611-622. [all data]
Streng, 1971
Streng, A.G.,
Miscibility and Compatibility of Some Liquid and Solidified Gases at Low Temperature,
J. Chem. Eng. Data, 1971, 16, 357. [all data]
Timmermans, 1935
Timmermans, J.,
Researches in Stoichiometry. I. The Heat of Fusion of Organic Compounds.,
Bull. Soc. Chim. Belg., 1935, 44, 17-40. [all data]
Younglove and Ely, 1987
Younglove, B.A.; Ely, J.F.,
Thermophysical Properties of Fluids II. Methane, Ethane, Propane, Isobutane, and Normal Butane,
J. Phys. Chem. Ref. Data, 1987, 16, 577. [all data]
Majer and Svoboda, 1985
Majer, V.; Svoboda, V.,
Enthalpies of Vaporization of Organic Compounds: A Critical Review and Data Compilation, Blackwell Scientific Publications, Oxford, 1985, 300. [all data]
Stephenson and Malanowski, 1987
Stephenson, Richard M.; Malanowski, Stanislaw,
Handbook of the Thermodynamics of Organic Compounds, 1987, https://doi.org/10.1007/978-94-009-3173-2
. [all data]
Carruth and Kobayashi, 1973
Carruth, Grant F.; Kobayashi, Riki,
Vapor pressure of normal paraffins ethane through n-decane from their triple points to about 10 mm mercury,
J. Chem. Eng. Data, 1973, 18, 2, 115-126, https://doi.org/10.1021/je60057a009
. [all data]
Reid, 1972
Reid, Robert C.,
Handbook on vapor pressure and heats of vaporization of hydrocarbons and related compounds, R. C. Wilhort and B. J. Zwolinski, Texas A Research Foundation. College Station, Texas(1971). 329 pages.$10.00,
AIChE J., 1972, 18, 6, 1278-1278, https://doi.org/10.1002/aic.690180637
. [all data]
Loomis and Walters, 1926
Loomis, A.G.; Walters, J.E.,
THE VAPOR PRESSURE OF ETHANE NEAR THE NORMAL BOILING POINT 1,
J. Am. Chem. Soc., 1926, 48, 8, 2051-2055, https://doi.org/10.1021/ja01419a006
. [all data]
Regnier, 1972
Regnier, J.,
J. Chim. Phys. Phys.-Chim. Biol., 1972, 69, 6, 942. [all data]
Bondi, 1963
Bondi, A.,
Heat of Siblimation of Molecular Crystals: A Catalog of Molecular Structure Increments.,
J. Chem. Eng. Data, 1963, 8, 3, 371-381, https://doi.org/10.1021/je60018a027
. [all data]
Domalski and Hearing, 1996
Domalski, Eugene S.; Hearing, Elizabeth D.,
Heat Capacities and Entropies of Organic Compounds in the Condensed Phase. Volume III,
J. Phys. Chem. Ref. Data, 1996, 25, 1, 1, https://doi.org/10.1063/1.555985
. [all data]
Kemper, Bushnell, et al., 1993
Kemper, P.R.; Bushnell, J.; Von Koppen, P.; Bowers, M.T.,
Binding Energies of Co+(H2/CH4/C2H6)1,2,3 Clusters,
J. Phys. Chem., 1993, 97, 9, 1810, https://doi.org/10.1021/j100111a016
. [all data]
Armentrout and Kickel, 1994
Armentrout, P.B.; Kickel, B.L.,
Gas Phase Thermochemistry of Transition Metal Ligand Systems: Reassessment of Values and Periodic Trends, in Organometallic Ion Chemistry, B. S. Freiser, ed, 1994. [all data]
Fowell, 1961
Fowell, P.A.,
Ph. D. Thesis, University of Manchester, 1961. [all data]
Cox and Pilcher, 1970
Cox, J.D.; Pilcher, G.,
Thermochemistry of Organic and Organometallic Compounds
in Academic Press, New York, 1970. [all data]
Smith, 1967
Smith, M.B.,
J. Phys. Chem., 1967, 71, 364. [all data]
DePuy, Gronert, et al., 1989
DePuy, C.H.; Gronert, S.; Barlow, S.E.; Bierbaum, V.M.; Damrauer, R.,
The Gas Phase Acidities of the Alkanes,
J. Am. Chem. Soc., 1989, 111, 6, 1968, https://doi.org/10.1021/ja00188a003
. [all data]
DePuy, Bierbaum, et al., 1984
DePuy, C.H.; Bierbaum, V.M.; Damrauer, R.,
Relative Gas-Phase Acidities of the Alkanes,
J. Am. Chem. Soc., 1984, 106, 4051. [all data]
Holm, 1974
Holm, T.,
J. Organometal. Chem., 1974, 77, 27. [all data]
Pedley and Rylance, 1977
Pedley, J.B.; Rylance, J.,
Computer Analysed Thermochemical Data: Organic and Organometallic Compounds, University of Sussex, Brigton, 1977. [all data]
Liebman, Martinho Simões, et al., 1995
Liebman, J.F.; Martinho Simões, J.A.; Slayden, S.W.,
In Lithium Chemistry: A Theoretical and Experimental Overview Wiley: New York, Sapse, A.-M.; Schleyer, P. von Ragué, ed(s)., 1995. [all data]
Brown, Ishikawa, et al., 1990
Brown, C.E.; Ishikawa, Y.; Hackett, P.A.; Rayner, D.M.,
J. Am. Chem. Soc., 1990, 112, 2530. [all data]
Ishikawa, Brown, et al., 1988
Ishikawa, Y.; Brown, C.E.; Hackett, P.A.; Rayner, D.M.,
Chem. Phys. Lett., 1988, 150, 506. [all data]
Carpenter, van Koppen, et al., 1995
Carpenter, C.J.; van Koppen, P.A.M.; Bowers, M.T.,
Details of Potential Energy Surfaces Involving C-C Bond Activation: Reactions of Fe+, Co+ and Ni+ with Acetone,
J. Am. Chem. Soc., 1995, 117, 44, 10976, https://doi.org/10.1021/ja00149a021
. [all data]
Lacher, Amador, et al., 1967
Lacher, J.R.; Amador, A.; Park, J.D.,
Reaction heats of organic compounds. Part 5.-Heats of hydrogenation of dichloromethane, 1,1- and 1,2-dichloroethane and 1,2-dichloropropane,
Trans. Faraday Soc., 1967, 63, 1608-1611. [all data]
Cox and Pilcher, 1970, 2
Cox, J.D.; Pilcher, G.,
Thermochemistry of Organic and Organometallic Compounds, Academic Press, New York, 1970, 1-636. [all data]
Conn, Kistiakowsky, et al., 1939
Conn, J.B.; Kistiakowsky, G.B.; Smith, E.A.,
Heats of organic reactions. VIII. Some further hydrogenations, including those of some acetylenes,
J. Am. Chem. Soc., 1939, 61, 1868-1876. [all data]
Carson, Hartley, et al., 1949
Carson, A.S.; Hartley, K.; Skinner, H.A.,
Thermochemistry of metal alkyls. Part II.?The bond dissociation energies of some Zn?C and Cd?C bonds, and of Et?I.,
Trans. Faraday Soc., 1949, 45, 1159, https://doi.org/10.1039/tf9494501159
. [all data]
Kistiakowsky and Nickle, 1951
Kistiakowsky, G.B.; Nickle, A.G.,
Ethane-ethylene and propane-propylene equilibria,
Faraday Discuss. Chem. Soc., 1951, 10, 175-187. [all data]
Kistiakowsky, Romeyn, et al., 1935
Kistiakowsky, G.B.; Romeyn, H., Jr.; Ruhoff, J.R.; Smith, H.A.; Vaughan, W.E.,
Heats of organic reactions. I. The apparatus and the heat of hydrogenation of ethylene,
J. Am. Chem. Soc., 1935, 57, 65-75. [all data]
Shaulov and Shmyreva, 1968
Shaulov, Yu.Kh.; Shmyreva, G.O.,
Russ. J. Phys. Chem., 1968, 42, 1008. [all data]
Hiraoka and Kebarle, 1980
Hiraoka, K.; Kebarle, P.,
Ion Molecule Reactions in Ethane. Thermochemistry and Structures of the Intermediate Complexes: C4H11+ and C4H10+ Formed in the Reactions of C2H5+ and C2H4+ with C2H6,
Can. J. Chem., 1980, 58, 21, 2262, https://doi.org/10.1139/v80-364
. [all data]
Lacher, Emery, et al., 1956
Lacher, J.R.; Emery, E.; Bohmfalk, E.; Park, J.D.,
Reaction heats of organic compounds. IV. A high temperature calorimeter and the hydrogenation of methyl ethyl and vinyl chlorides,
J. Phys. Chem., 1956, 60, 492-495. [all data]
Lacher, Kianpour, et al., 1956
Lacher, J.R.; Kianpour, A.; Oetting, F.; Park, J.D.,
Reaction calorimetry. The hydrogenation of organic fluorides and chlorides,
Trans. Faraday Soc., 1956, 52, 1500-1508. [all data]
Holm, 1981
Holm, T.,
J. Chem. Soc., Perkin Trans. II, 1981, 464.. [all data]
Stockigt, Schwarz, et al., 1996
Stockigt, D.; Schwarz, J.; Schwarz, H.,
Theoretical and Experimental Studies on the Bond Dissociation Energies of Al(methane)+, Al(acetylene)+, Al(ethene)+, and Al(ethane)+,
J. Phys. Chem., 1996, 100, 21, 8786, https://doi.org/10.1021/jp960060k
. [all data]
Lacher, Kianpour, et al., 1957
Lacher, J.R.; Kianpour, A.; Montgomery, P.; Knedler, H.; Park, J.D.,
Reaction heats of organic halogen compounds. IX. The catalytic hydrogenation of vinyl and perfluorovinyl bromide,
J. Phys. Chem., 1957, 61, 1125-1126. [all data]
Ashcroft, Carson, et al., 1965
Ashcroft, S.J.; Carson, A.S.; Carter, W.; Laye, P.G.,
Thermochemistry of reductions caused by lithium aluminium hydride. Part 3.- The C-halogen bond dissociation energies in ethyl iodine and ethyl bromide,
Trans. Faraday Soc., 1965, 61, 225-229. [all data]
Fowell, Lacher, et al., 1965
Fowell, P.; Lacher, J.R.; Park, J.D.,
Reaction heats of organic compounds. Part 3.-Heats of hydrogenation of methyl bromide and ethyl bromide,
Trans. Faraday Soc., 1965, 61, 1324-1327. [all data]