2H-Pyran-2-one, 5,6-dihydro-3,5,5-trimethyl-
- Formula: C8H12O2
- Molecular weight: 140.1797
- IUPAC Standard InChIKey: QQKORHIXEIINLR-UHFFFAOYSA-N
- CAS Registry Number: 74793-10-5
- Chemical structure:
View 3d structure (requires JavaScript / HTML 5) - Permanent link for this species. Use this link for bookmarking this species for future reference.

Phase change data

Data compiled by: Thermodynamics Research Center, NIST Boulder Laboratories, Chris Muzny director
Quantity | Value | Units | Method | Reference | Comment |
---|---|---|---|---|---|
Tfus | 298.6 | K | N/A | Anonymous, 1953 | Uncertainty assigned by TRC = 0.8 K |

References

Anonymous, 1953
Anonymous, R.,
, Physical Properties of Chemical Substances, Dow Chemical Company, 1953. [all data]