Cholesta-3,5-diene
- Formula: C27H44
- Molecular weight: 368.6383
- IUPAC Standard InChIKey: RLHIRZFWJBOHHD-OYZXCHQLSA-N
- CAS Registry Number: 747-90-0
- Chemical structure:
View 3d structure (requires JavaScript / HTML 5) - Stereoisomers:
- Other names: δ(3,5)-Cholestadiene; Cholesterilene; Cholestadiene; 3,5-Cholestadiene; Cholest-3,5-diene; D3,5-cholestadiene

Normal alkane RI, non-polar column, temperature ramp

Column type | Active phase | I | Reference | Comment |
---|---|---|---|---|
Packed | OV-101 | 2880. | Velísek, Davídek, et al., 1986 | N2, Chromatron N-AW-DMCS, 5. K/min; Column length: 2.4 m; Tstart: 100. C; Tend: 240. C |

References

Velísek, Davídek, et al., 1986
Velísek, J.; Davídek, J.; Kubelka, V.,
Formation of Δ3,5-diene and 3-chloro Δ5-ene analogues of sterols in protein hydrolysates,
J. Agric. Food Chem., 1986, 34, 4, 660-662, https://doi.org/10.1021/jf00070a017
. [all data]