Methyl α-chlorophenylacetate
- Formula: C9H9ClO2
- Molecular weight: 184.620
- IUPAC Standard InChIKey: XOIOYHPJZJLTGK-UHFFFAOYSA-N
- CAS Registry Number: 7476-66-6
- Chemical structure:
View 3d structure (requires JavaScript / HTML 5) - Other names: Methyl chloro(phenyl)acetate; Methyl alpha-chlorophenylacetate; Methyl a-chlorophenylacetate

Phase change data

Data compiled by: Robert L. Brown and Stephen E. Stein
Reduced pressure boiling point
Tboil (K) | Pressure (bar) | Reference |
---|---|---|
401. to 404. | 0.023 | Frinton Laboratories Inc., 1986 |

References

Frinton Laboratories Inc., 1986
Frinton Laboratories Inc.,
Catalog Number 11, Frinton Laboratories Inc., Vineland, NJ, 1986, 99. [all data]