Ethyl 2,2-diethoxypropionate
- Formula: C9H18O4
- Molecular weight: 190.2368
- IUPAC Standard InChIKey: BVAMIFTXHAJQHP-UHFFFAOYSA-N
- CAS Registry Number: 7476-20-2
- Chemical structure:
View 3d structure (requires JavaScript / HTML 5) - Other names: Propanoic acid, 2,2-diethoxy-, ethyl ester; Propionic acid, 2,2-diethoxy-, ethyl ester; Ethyl 2,2-diethoxypropanoate

Phase change data

Data compiled by: Robert L. Brown and Stephen E. Stein
Reduced pressure boiling point
Tboil (K) | Pressure (bar) | Reference |
---|---|---|
366. to 367. | 0.035 | Frinton Laboratories Inc., 1986 |

Normal alkane RI, non-polar column, custom temperature program

Column type | Active phase | I | Reference | Comment |
---|---|---|---|---|
Capillary | HP-5 | 1106. | Zhao, Li, et al., 2008 | 30. m/0.25 mm/0.25 μm; Program: 40 0C (2 min) 5 0C/min -> 80 0C 7 oC/min -> 160 0C 9 0C/min -> 200 0C 20 0C/min -> 280 0C (10 min) |

References

Frinton Laboratories Inc., 1986
Frinton Laboratories Inc.,
Catalog Number 11, Frinton Laboratories Inc., Vineland, NJ, 1986, 99. [all data]
Zhao, Li, et al., 2008
Zhao, Y.; Li, J.; Xu, Y.; Duan, H.; Fan, W.; Zhao, G.,
EXtraction, preparation and identification of volatile compounds in Changyu XO brandy,
Chinese J. Chromatogr., 2008, 26, 2, 212-222, https://doi.org/10.1016/S1872-2059(08)60014-0
. [all data]