Pentanoic acid, 2-phenylethyl ester

Normal alkane RI, non-polar column, temperature ramp

View large format table.

Column type Active phase I Reference Comment
CapillaryDB-11539.Rapior, Konska, et al., 200025. m/0.25 mm/0.13 μm, He, 60. C @ 2. min, 4. K/min; Tend: 200. C

Normal alkane RI, non-polar column, custom temperature program

View large format table.

Column type Active phase I Reference Comment
CapillarySE-301517.Vinogradov, 2004Program: not specified

Normal alkane RI, polar column, custom temperature program

View large format table.

Column type Active phase I Reference Comment
CapillaryCarbowax 20M2034.Vinogradov, 2004Program: not specified

References

Rapior, Konska, et al., 2000
Rapior, S.; Konska, G.; Guillot, J.; Andary, C.; Bessiere, J.-M., Volatile composition of Laetiporus sulphureus, Cryptogamie, Mycol., 2000, 21, 1, 67-72, https://doi.org/10.1016/S0181-1584(00)00109-3 . [all data]

Vinogradov, 2004
Vinogradov, B.A., Production, composition, properties and application of essential oils, 2004, retrieved from http://viness.narod.ru. [all data]