dichlorobis(1-hexadeanamine)copper(II)
- Formula: C32H70Cl2CuN2
- Molecular weight: 617.364
- CAS Registry Number: 74541-02-9

Phase change data

Data compiled by: Thermodynamics Research Center, NIST Boulder Laboratories, Chris Muzny director
Quantity | Value | Units | Method | Reference | Comment |
---|---|---|---|---|---|
Tfus | 402. | K | N/A | Busico, Carfagna, et al., 1980 | Crystal phase 1 phase; Uncertainty assigned by TRC = 1. K |

References

Busico, Carfagna, et al., 1980
Busico, V.; Carfagna, C.; Salerno, V.; Vacatello, M.,
Thermal behaviour of complexes of general formula (n-CnH2n+1NH2)2CuCl2,
Thermochim. Acta, 1980, 39, 1. [all data]