Butanoic acid, 2-methyl-, ethyl ester
- Formula: C7H14O2
- Molecular weight: 130.1849
- IUPAC Standard InChIKey: HCRBXQFHJMCTLF-UHFFFAOYSA-N
- CAS Registry Number: 7452-79-1
- Chemical structure:
View 3d structure (requires JavaScript / HTML 5) - Isotopologues:
- Stereoisomers:
- Other names: Butyric acid, 2-methyl-, ethyl ester; Ethyl α-methylbutyrate; Ethyl 2-methylbutanoate; Ethyl 2-methylbutyrate; 2-Methylbutanoic acid ethyl ester; NSC 1103

Condensed phase thermochemistry data

Data compiled as indicated in comments:
ALS - Hussein Y. Afeefy, Joel F. Liebman, and Stephen E. Stein
DH - Eugene S. Domalski and Elizabeth D. Hearing
Quantity | Value | Units | Method | Reference | Comment |
---|---|---|---|---|---|
ΔfH°liquid | -560.4 ± 1.4 | kJ/mol | Ccb | Verevkin, Beckhaus, et al., 1992 | See 90BEC/VER; ALS |
Quantity | Value | Units | Method | Reference | Comment |
ΔcH°liquid | -4195.0 ± 1.3 | kJ/mol | Ccb | Verevkin, Beckhaus, et al., 1992 | See 90BEC/VER; Corresponding ΔfHºliquid = -560.40 kJ/mol (simple calculation by NIST; no Washburn corrections); ALS |
ΔcH°liquid | -4188.6 ± 8.4 | kJ/mol | Ccb | Hancock, Watson, et al., 1954 | Reanalyzed by Cox and Pilcher, 1970, Original value = -4188. kJ/mol; Heat of formation derived by Cox and Pilcher, 1970; Corresponding ΔfHºliquid = -566.76 kJ/mol (simple calculation by NIST; no Washburn corrections); ALS |
Constant pressure heat capacity of liquid
Cp,liquid (J/mol*K) | Temperature (K) | Reference | Comment |
---|---|---|---|
327.4 | 298.15 | Verevkin, Beckhaus, et al., 1992 | DH |

Phase change data

Data compiled as indicated in comments:
BS - Robert L. Brown and Stephen E. Stein
TRC - Thermodynamics Research Center, NIST Boulder Laboratories, Chris Muzny director
ALS - Hussein Y. Afeefy, Joel F. Liebman, and Stephen E. Stein
DRB - Donald R. Burgess, Jr.
AC - William E. Acree, Jr., James S. Chickos
Quantity | Value | Units | Method | Reference | Comment |
---|---|---|---|---|---|
Tboil | 406.2 | K | N/A | Aldrich Chemical Company Inc., 1990 | BS |
Tboil | 406.05 | K | N/A | Hancock, Watson, et al., 1954, 2 | Uncertainty assigned by TRC = 0.4 K; TRC |
Quantity | Value | Units | Method | Reference | Comment |
ΔvapH° | 44.3 ± 0.3 | kJ/mol | V | Verevkin, Beckhaus, et al., 1992 | See 90BEC/VER; ALS |
ΔvapH° | 44.3 | kJ/mol | N/A | Verevkin, Beckhaus, et al., 1992 | DRB |
ΔvapH° | 64.7 | kJ/mol | GS | Verevkin, Beckhaus, et al., 1992 | Based on data from 288. to 308. K.; AC |
ΔvapH° | 44. ± 1. | kJ/mol | V | Hancock, Watson, et al., 1954 | Heat of formation derived by Cox and Pilcher, 1970; ALS |

Van Den Dool and Kratz RI, non-polar column, temperature ramp

Data compiled by: NIST Mass Spectrometry Data Center, William E. Wallace, director

Column type CapillaryCapillaryCapillaryCapillaryCapillary
Active phase DB-5MSDB-5MSSPB-5DB-5DB-5
Column length (m) 30.30.60.30.30.
Carrier gas HeHe HeHe
Substrate
Column diameter (mm) 0.250.250.320.320.32
Phase thickness (μm) 0.250.251.0.50.24
Tstart (C) 40.40.40.40.40.
Tend (C) 200.200.230.265.240.
Heat rate (K/min) 4.4.3.7.6.
Initial hold (min) 1.1.2. 2.
Final hold (min) 10.10.10.5.10.
I 893.895.848.840.850.
ReferenceCho, Namgung, et al., 2008Cho I.H., Lee S.M., et al., 2007Engel and Ratel, 2007Mahattanatawee K., Perez-Cacho P.R., et al., 2007Scheidig, Czerny, et al., 2007
Comment MSDC-RI MSDC-RI MSDC-RI MSDC-RI MSDC-RI
Column type CapillaryCapillaryCapillaryCapillaryCapillary
Active phase RTX-5DB-5DB-5DB-5MSDB-5
Column length (m) 10.30.30.30.30.
Carrier gas He  HeN2
Substrate
Column diameter (mm) 0.180.320.250.250.32
Phase thickness (μm) 0.20.251.0.251.
Tstart (C) 40.40.50.40.40.
Tend (C) 275.240.290.200.230.
Heat rate (K/min) 50.6.10.4.4.
Initial hold (min) 0.52.1.1.2.
Final hold (min) 0.510.10.10.10.
I 854.847.835.895.849.
ReferenceSetkova, Risticevic, et al., 2007Steinhaus and Schieberle, 2007Bylaite and Meyer, 2006Cho, Kim, et al., 2006Fang and Qian, 2005
Comment MSDC-RI MSDC-RI MSDC-RI MSDC-RI MSDC-RI
Column type CapillaryCapillaryCapillaryCapillaryCapillary
Active phase HP-5HP-5HP-5MSZB-5CP-Sil 8CB-MS
Column length (m) 30.30.30.30.60.
Carrier gas HeHeHeHelium
Substrate
Column diameter (mm) 0.250.250.250.320.25
Phase thickness (μm) 0.250.250.250.500.25
Tstart (C) 50.50.60.40.40.
Tend (C) 250.250.250.265.280.
Heat rate (K/min) 4.4.4.7.4.
Initial hold (min) 5.5.2. 2.
Final hold (min) 15.15.20.5.5.
I 850.850.842.847.846.
ReferenceMahattanatawee, Goodner, et al., 2005Mahattanatawee, Goodner, et al., 2005Pino, Mesa, et al., 2005Bell, 2004Hierro, de la Hoz, et al., 2004
Comment MSDC-RI MSDC-RI MSDC-RI MSDC-RI MSDC-RI
Column type CapillaryCapillaryCapillaryCapillaryCapillary
Active phase CP-Sil 8CB-MSHP-5DB-5DB-5CP Sil 5 CB
Column length (m) 60.30.60.15.50.
Carrier gas  N2He He
Substrate
Column diameter (mm) 0.250.250.250.320.32
Phase thickness (μm) 0.250.250.250.50.4
Tstart (C) 40.60.40.30.60.
Tend (C) 280.220.275.225.280.
Heat rate (K/min) 4.5.7.10.3.
Initial hold (min) 2.10. 2.10.
Final hold (min) 5.  20.60.
I 851.841.846.850.829.
ReferenceBruna, Hierro, et al., 2003Emilio Tomei, Manganelli, et al., 2003Valim, Rouseff, et al., 2003Zhou, Wintersteen, et al., 2002Pino and Marbot, 2001
Comment MSDC-RI MSDC-RI MSDC-RI MSDC-RI MSDC-RI
Column type CapillaryCapillaryCapillaryCapillaryCapillary
Active phase DB-5HP-5HP-5OV-101OV-101
Column length (m) 30.30.30.15.15.
Carrier gas HeHeHe
Substrate
Column diameter (mm) 0.0530.250.250.320.32
Phase thickness (μm) 1.5 0.25
Tstart (C) 0.50.35.35.35.
Tend (C) 230.200.280.250.250.
Heat rate (K/min) 6.4.5.36.6.
Initial hold (min)  1. 3.3.
Final hold (min)   5.
I 848.870.850.0843.843.
ReferenceRychlik and Bosset, 2001Shalit, Katzir, et al., 2001Siegmund, Derler, et al., 2001Chisholm, Guiher, et al., 1994Chisholm, Guiher, et al., 1994
Comment MSDC-RI MSDC-RI MSDC-RI MSDC-RI MSDC-RI
Column type Capillary
Active phase OV-101
Column length (m) 15.
Carrier gas
Substrate
Column diameter (mm) 0.32
Phase thickness (μm)
Tstart (C) 35.
Tend (C) 250.
Heat rate (K/min) 6.
Initial hold (min) 3.
Final hold (min)
I 845.
ReferenceChisholm, Guiher, et al., 1994
Comment MSDC-RI

Van Den Dool and Kratz RI, polar column, custom temperature program

Data compiled by: NIST Mass Spectrometry Data Center, William E. Wallace, director

Column type CapillaryCapillaryCapillaryCapillaryCapillary
Active phase DB-WaxDB-WaxDB-WaxFFAPSOLGel-Wax
Column length (m) 30.30.30.30.30.
Carrier gas H2HeHe He
Substrate
Column diameter (mm) 0.320.250.250.320.25
Phase thickness (μm) 0.50.50.50.250.25
Program 40C(5min) => 4C/min => 100C6C/min => 136C => 3C/min => 220C (10min)40C => 5C/min => 60C(30min) => 5C/min => 240C40C => 5C/min => 60C(30min) => 5C/min => 240C40C(2min) => 6C/min => 150C => 20C/min => 230C35C(5min) => 3C/min => 150C => 5C/min => 250C (10min)
I 1069.1051.1047.1049.1043.
ReferenceEscudero, Campo, et al., 2007Mehinagic, Royer, et al., 2006Mehinagic, Royer, et al., 2006Schuh and Schieberle, 2006Aubert, Baumann, et al., 2005
Comment MSDC-RI MSDC-RI MSDC-RI MSDC-RI MSDC-RI
Column type CapillaryCapillaryCapillaryCapillaryCapillary
Active phase SOLGel-WaxDB-WaxCP-Wax 52CBStabilwaxStabilwax
Column length (m) 30.30.50.30.30.
Carrier gas HeH2HeHeHe
Substrate
Column diameter (mm) 0.250.320.250.320.32
Phase thickness (μm) 0.250.50.21.1.
Program 35C(5min) => 3C/min => 150C => 5C/min => 250C(10 min)40C(5min) => 4C/min => 100C => 6C/min => 200C33C(1.5min) => 1.5C/min => 60C(4min) => 2C/min => 100C => 8C/min => 220C(15min)40C(2min) => 5C/min => 100C => 4C/min => 230C (10min)40C(2min) => 5C/min => 100C => 4C/min => 230C (10min)
I 1043.1070.1045.1051.1070.
ReferenceAubert, Baumann, et al., 2005Campo, Ferreira, et al., 2005Kaack, Christensen, et al., 2005Wang, Finn, et al., 2005Wang, Finn, et al., 2005
Comment MSDC-RI MSDC-RI MSDC-RI MSDC-RI MSDC-RI
Column type CapillaryCapillaryCapillaryCapillaryCapillary
Active phase DB-WaxDB-WaxStabilwaxStabilwaxDB-Wax
Column length (m) 30.60.30.30.30.
Carrier gas HeliumHeHeHeHe
Substrate
Column diameter (mm) 0.320.250.320.320.25
Phase thickness (μm) 0.500.251.1.0.5
Program not specified35C(0.7min) => 20C/min => 70C => 4C/min => 240C40C (2min) => 5C/min => 100C => 4C/min => 230C (10min)40C(2min) => 5C/min => 100C => 4C/min => 230C(10min)40C(2min) => 2C/min => 100C => 10C/min => 230C (5min)
I 1041.1035.1052.1053.1052.
ReferenceBell, 2004Ferrari, Lablanquie, et al., 2004Klesk, Qian, et al., 2004Klesk and Qian, 2003Klesk and Qian, 2003, 2
Comment MSDC-RI MSDC-RI MSDC-RI MSDC-RI MSDC-RI
Column type CapillaryCapillaryCapillaryCapillaryCapillary
Active phase HP-FFAPFFAPDB-WaxFFAPFFAP
Column length (m) 30.30.30.25.30.
Carrier gas  He HeHe
Substrate
Column diameter (mm) 0.320.320.250.320.32
Phase thickness (μm) 0.250.250.25 0.25
Program 35C(5min) => 10C/min => 150C => 20C/min => 250C(10 min)35C (2min) => 60C/min => 50C (2min) => 6C/min => 240C (10min)20C(30s) => fast => 60C => 4C/min => 220C (20min)35C (2min) => 40C/min => 60C (2min) => 6C/min => 180C => 10C/min => 240C35C (2min) => 40C/min => 60C (2min) => 6C/min => 180C => 10C/min => 230C (5min)
I 1053.1042.1043.1040.1045.
ReferenceCarrapiso, Ventanas, et al., 2002Kirchhoff and Schieberle, 2002Cantergiani, Brevard, et al., 2001Steinhaus and Schieberle, 2000Tairu, Hofmann, et al., 1999
Comment MSDC-RI MSDC-RI MSDC-RI MSDC-RI MSDC-RI

Kovats' RI, non-polar column, temperature ramp

Data compiled by: NIST Mass Spectrometry Data Center, William E. Wallace, director

Column type CapillaryCapillaryCapillaryCapillaryCapillary
Active phase OV-101DB-1DB-1DB-1DB-1
Column length (m) 12.60.60.60.60.
Carrier gas HeHeHeHeHe
Substrate
Column diameter (mm) 0.320.320.320.320.32
Phase thickness (μm)  0.250.250.250.25
Tstart (C) 35.30.30.30.30.
Tend (C) 185.210.210.210.210.
Heat rate (K/min) 6.2.2.2.2.
Initial hold (min) 3.4.4.4.4.
Final hold (min)
I 837.843.842.842.842.
ReferenceMarin, Acree, et al., 1992Takeoka, Buttery, et al., 1992Takeoka, Buttery, et al., 1992Takeoka, Buttery, et al., 1992Takeoka, Buttery, et al., 1992
Comment MSDC-RI MSDC-RI MSDC-RI MSDC-RI MSDC-RI
Column type CapillaryCapillaryCapillary
Active phase DB-1DB-1OV-101
Column length (m) 60.60.25.
Carrier gas HeHeHe
Substrate
Column diameter (mm) 0.320.320.31
Phase thickness (μm) 0.250.25
Tstart (C) 30.30.60.
Tend (C) 210.210.200.
Heat rate (K/min) 2.2.2.
Initial hold (min) 4.4.
Final hold (min)
I 841.842.844.
ReferenceTakeoka, Flath, et al., 1990Takeoka, Flath, et al., 1990Morales and Duque, 1987
Comment MSDC-RI MSDC-RI MSDC-RI

Normal alkane RI, polar column, custom temperature program

Data compiled by: NIST Mass Spectrometry Data Center, William E. Wallace, director

Column type CapillaryCapillaryCapillaryCapillaryCapillary
Active phase EC-1000DB-WaxDB-WaxHP-InnowaxDB-Wax
Column length (m)  60.30.30.30.
Carrier gas  HeliumHydrogenHeliumHydrogen
Substrate
Column diameter (mm)  0.250.250.250.32
Phase thickness (μm)  0.500.250.250.50
Program not specified40 0C 4 0C/min -> 230 0C 100 0C/min -> 260 0C (11.7 min)35 0C (9 min) 5 0C/min -> 80 0C 1 0C/min -> 100 0C 16 0C/min -> 210 0C (20 min)45 0C (1 min) 5 oC/min -> 170 0C 10 0C/min -> 260 0C (1 min)40 0C (5 min) 4 0C/min -> 100 0C 6 0C/min -> 220 0C (20 min)
I 1055.1054.1048.1062.1050.
ReferenceDelabre and Bendall, 9999Miyazaki, Plotto, et al., 2011Sampaio, Garruti, et al., 2011Cajka, Riddellova, et al., 2010San-Juan, Petka, et al., 2010
Comment MSDC-RI MSDC-RI MSDC-RI MSDC-RI MSDC-RI
Column type CapillaryCapillaryCapillaryCapillaryCapillary
Active phase Supelko CO WaxDB-WaxFFAPDB-WaxDB-Wax
Column length (m) 60.30.50.20.20.
Carrier gas Helium HeliumHeliumHelium
Substrate
Column diameter (mm) 0.320.320.200.180.18
Phase thickness (μm) 0.250.500.330.180.18
Program 40 0C (5 min) 4 0C/min -> 75 0C 5 0C/min -> 250 0C (10 min)40 0C (5 min) 4 0C/min -> 100 0C 6 0C/min -> 220 0C (40 min)70 0C (1 min) 3 0C/min -> 142 0C 5 0C/min -> 225 0C (10 min)35 0C (1 min) 2.9 0C/min -> 100 0C 8 0C/min -> 200 0C (5 min)35 0C (1 min) 2/9 0C/min -> 100 0C 8 0C/min -> 200 0C (5 min)
I 1063.1050.1015.1038.1038.
ReferenceVekiari, Orepoulou, et al., 2010Ferreira, Juan, et al., 2009Ortiz, Echeverra, et al., 2009Rowan, Hunt, et al., 2009Rowan, Hunt, et al., 2009, 2
Comment MSDC-RI MSDC-RI MSDC-RI MSDC-RI MSDC-RI
Column type CapillaryCapillaryCapillaryCapillaryCapillary
Active phase DB-WaxFFAPBP-20DB-WaxSupelcowax-10
Column length (m) 30. 30.30.30.
Carrier gas HeliumHeliumHeliumHeliumHe
Substrate
Column diameter (mm) 0.32 0.250.320.25
Phase thickness (μm) 0.50 0.250.250.25
Program 40 0C 7 0C/min -> 110 0C 15 0C/min -> 250 0C (3 min)not specified40 0C (1 min) 2 0C/min -> 100 0C (2 min) 1.7 0C/min -> 180 0C (1 min) 25 0C/min -> 220 0C (10 min)50 0C 20 0C/min -> 80 0C 3 0C/min -> 230 0C40C(10min) => 2C/min => 200C(1min) => 2C/min => 250C (10min)
I 1067.1031.1097.1047.1055.
ReferenceValappil, Fan, et al., 2009Frauendorfer and Schieberle, 2008Rodrigues, Caldera, et al., 2008Tao, Wenlai, et al., 2008Bosch-Fuste, Riu-Aumatell, et al., 2007
Comment MSDC-RI MSDC-RI MSDC-RI MSDC-RI MSDC-RI
Column type CapillaryCapillaryCapillaryCapillaryCapillary
Active phase HP-FFAPFFAPDB-FFAPFFAPDB-Wax
Column length (m) 30.50.30.50.30.
Carrier gas  He HeHe
Substrate
Column diameter (mm) 0.320.20.320.20.25
Phase thickness (μm) 0.250.330.250.330.25
Program 35 0C (10 min) 10 0C/min -> 150 0C 20 0C/min -> 250 0C (10 min)70C(1min) => 3C/min => 142C => 5C/min => 225C (10min)35C(2min) => 40C/min => 50C(2min) => 6C/min => 180C => 10C/min => 230C(10min)70C(1min) => 3C/min => 142C => 5C/min => 225C(10min)50 0C (2 min) 6 0C/min -> 150 0C 8 0C/min -> 230 0C (15 min)
I 1053.1059.1040.1059.1038.
ReferenceCarrapiso and Garsia, 2007Lara, Echeverría, et al., 2007Lasekan, Buettner, et al., 2007Lopez, Villatoro, et al., 2007Tian, Zhang, et al., 2007
Comment MSDC-RI MSDC-RI MSDC-RI MSDC-RI MSDC-RI
Column type CapillaryCapillaryCapillaryCapillaryCapillary
Active phase DB-WaxFFAPHP-InnowaxDB-WaxCP-Wax 58CB
Column length (m) 60.50.60.60.25.
Carrier gas H2HeNitrogenHeHelium
Substrate
Column diameter (mm) 0.320.20.250.250.32
Phase thickness (μm) 0.50.330.250.250.20
Program 40C(2min) => 6C/min => 200C (15min) => 220C (20min)70C(1min) => 3C/min => 142C => 5C/min => 225C(10min)50 0C (4 min) -> 40 0C 4 0C/min -> 220 0C35C(5min) => 2C/min => 50C => 5C/min => 200C (5min)40 0C (2 min) 40 0C/min -> 60 0C (1 min) 6 0C/min -> 180 0C 10 0C/min -> 240 0C (5 min)
I 1055.1059.1045.1054.1048.
ReferenceFerreira, Pet'ka, et al., 2006Lara, Graell, et al., 2006Quijano and Pino, 2006Mattheis, Fan, et al., 2005Tokitomo, Steihaus, et al., 2005
Comment MSDC-RI MSDC-RI MSDC-RI MSDC-RI MSDC-RI
Column type CapillaryCapillaryCapillaryCapillaryCapillary
Active phase DB-FFAPFFAPFFAPDB-WaxCarbowax 20M
Column length (m) 30.30.50.
Carrier gas HeHeHe
Substrate
Column diameter (mm) 0.320.320.2
Phase thickness (μm) 0.250.250.33
Program 40C(2min) => 40C/min => 60C(2min) => 6C/min => 180C => 15C/min => 230C (10min)35C(1min) => 60C/min => 60C => 6C/min => 230C70C(1min) => 3C/min => 142C => 5C/min => 225C(10min)not specifiednot specified
I 1041.1055.1059.1050.1049.
ReferenceBuettner, 2004Didzbalis, Ritter, et al., 2004Echeverría, Correa, et al., 2004Escudero, Gogorza, et al., 2004Vinogradov, 2004
Comment MSDC-RI MSDC-RI MSDC-RI MSDC-RI MSDC-RI
Column type CapillaryCapillaryCapillaryCapillaryCapillary
Active phase HP-FFAPPEG-20MCP-WAX 57CBFFAPHP-Innowax
Column length (m) 50.30.50.30.60.
Carrier gas He HeHeHe
Substrate
Column diameter (mm) 0.20.250.250.320.25
Phase thickness (μm) 0.330.250.20.250.25
Program 70C(1min) => 3C/min => 142C => 5C/min => 225C (10min)50C(8min) => 4C/min => 110C => 16C/min => 200C40C(10min) => 5C/min => 100C => 3C/min => 180C => 20C/min => 210C (10min)35C (2min) => 40C/min => 60C (2min) => 6C/min => 180C => 10C/min => 230C (10min)60 0C (10 min) 4 K/min -> 220 0C (10 min) 1 K/min -> 240 0C
I 1059.1057.1051.1041.1063.
ReferenceEcheverria, Fuentes, et al., 2003Garruti, Franco, et al., 2003Martí, Mestres, et al., 2003Buettner and Schieberle, 2001Gören, Demirci, et al., 2001
Comment MSDC-RI MSDC-RI MSDC-RI MSDC-RI MSDC-RI
Column type CapillaryCapillaryCapillaryCapillaryCapillary
Active phase FFAPCross-linked FFAPFFAPFFAPFFAP
Column length (m) 50.50.50.30.25.
Carrier gas N2N2N2He
Substrate
Column diameter (mm) 0.20.20.20.320.32
Phase thickness (μm) 0.330.330.330.250.3
Program 70C(1min) => 3C/min => 142C(2min) => 25C/min => 230C(5min)70C(1min) => 3C/min => 142C (2min) => 25C/min => 230C(5min)70C (1min) => 3C/min => 142C (2min) => 25C/min => 230C (5min)35C(1min) => 40C/min => 60C (1min) => 6C/min => 230C35C (2min) => 40C/min => 60C(1min) => 6C/min => 230C
I 1061.1061.1061.1037.1046.
ReferenceLopez, Lavilla, et al., 2000Lavilla, Puy, et al., 1999López, Lavilla, et al., 1998Matsui, Guth, et al., 1998Reiners and Grosch, 1998
Comment MSDC-RI MSDC-RI MSDC-RI MSDC-RI MSDC-RI
Column type CapillaryCapillaryCapillary
Active phase DB-FFAPDB-FFAPFFAP
Column length (m) 30.30.30.
Carrier gas   He
Substrate
Column diameter (mm) 0.320.320.32
Phase thickness (μm) 0.250.250.25
Program 35C (1min) => 40C/min => 60C (1min) => 6C/min => 250C (10min)35C (1min) => 40C/min => 60C (1min) => 6C/min => 250C (10min)35C (2min) => 40C/min => 60C (2min) => 6C/min => 180C => 10C/min => 240C
I 1055.1055.1045.
ReferenceGuth, 1997Guth, 1997Schermann and Schieberle, 1997
Comment MSDC-RI MSDC-RI MSDC-RI

Kovats' RI, non-polar column, isothermal

Data compiled by: NIST Mass Spectrometry Data Center, William E. Wallace, director

Column type PackedPacked
Active phase SE-30SE-30
Column length (m) 3.73.
Carrier gas  N2
Substrate Chromosorb W AW DMCSChromosorb W AW (60-80 mesh)
Column diameter (mm)
Phase thickness (μm)
Temperature (C) 120.100.
I 834.833.
ReferenceHaken, Chretien, et al., 1981Chastrette, Heintz, et al., 1974
Comment MSDC-RI MSDC-RI

References

Verevkin, Beckhaus, et al., 1992
Verevkin, S.P.; Beckhaus, H.-D.; Ruchardt, C.,
Geminale substituenteneffekte Teil 5α. Standardbildungsenthalpien von alkylsubstituierten Malonsaure- und α-aminocarbonsaureestern,
Thermochim. Acta, 1992, 197, 27-39. [all data]
Hancock, Watson, et al., 1954
Hancock, C.K.; Watson, G.M.; Gilby, R.F.,
Heats of combustion of five-carbon fatty acids and their methyl and ethyl esters,
J. Phys. Chem., 1954, 58, 127-129. [all data]
Cox and Pilcher, 1970
Cox, J.D.; Pilcher, G.,
Thermochemistry of Organic and Organometallic Compounds, Academic Press, New York, 1970, 1-636. [all data]
Aldrich Chemical Company Inc., 1990
Aldrich Chemical Company Inc.,
Catalog Handbook of Fine Chemicals, Aldrich Chemical Company, Inc., Milwaukee WI, 1990, 1. [all data]
Hancock, Watson, et al., 1954, 2
Hancock, C.K.; Watson, G.M.; Gilby, R.F.,
Heats of Combustion of Five-Carbon Fatty Acids and Their Methyl and Ethyl Esters,
J. Phys. Chem., 1954, 58, 127. [all data]