5,5-Dimethylbicyclo[2.1.0]pent-2-ene
- Formula: C7H10
- Molecular weight: 94.1543
- IUPAC Standard InChIKey: HEINDVMVDRYAJA-UHFFFAOYSA-N
- CAS Registry Number: 74503-34-7
- Chemical structure:
View 3d structure (requires JavaScript / HTML 5) - Permanent link for this species. Use this link for bookmarking this species for future reference.

Reaction thermochemistry data

Data compiled by: Hussein Y. Afeefy, Joel F. Liebman, and Stephen E. Stein
Individual Reactions
By formula: 2H2 + C7H10 = C7H14
Quantity | Value | Units | Method | Reference | Comment |
---|---|---|---|---|---|
ΔrH° | -406. ± 0.8 | kJ/mol | Chyd | Roth, Klarner, et al., 1980 | liquid phase; solvent: Cyclohexane |
By formula: C7H10 = C7H10
Quantity | Value | Units | Method | Reference | Comment |
---|---|---|---|---|---|
ΔrH° | -179. ± 0.8 | kJ/mol | Ciso | Roth, Klarner, et al., 1980 | liquid phase; solvent: Heptane |

References

Roth, Klarner, et al., 1980
Roth, W.R.; Klarner, F.-G.; Lennartz, H.-W.,
Heats of hydrogenation. II. Heat of hydrogenation of bicyclo[2.1.0]pent-2-ene, an antiaromatic system,
Chem. Ber., 1980, 113, 1806-1818. [all data]