Zinc, bis(1-methylpropyl)-
- Formula: C8H18Zn
- Molecular weight: 179.61
- IUPAC Standard InChIKey: YDNAWKQOSYKOSA-UHFFFAOYSA-N
- CAS Registry Number: 7446-94-8
- Chemical structure:
View 3d structure (requires JavaScript / HTML 5) - Permanent link for this species. Use this link for bookmarking this species for future reference.

Phase change data

Data compiled as indicated in comments:
BS - Robert L. Brown and Stephen E. Stein
MS - José A. Martinho Simões
AC - William E. Acree, Jr., James S. Chickos
Quantity | Value | Units | Method | Reference | Comment |
---|---|---|---|---|---|
ΔvapH° | 40.9 ± 0.2 | kJ/mol | N/A | Sokolovskii and Baev, 1984 | MS |
Reduced pressure boiling point
Tboil (K) | Pressure (bar) | Reference | Comment |
---|---|---|---|
329. | 0.005 | Buckingham and Donaghy, 1982 | BS |
321. | 0.003 | Buckingham and Donaghy, 1982 | BS |
Enthalpy of vaporization
ΔvapH (kJ/mol) | Temperature (K) | Reference | Comment |
---|---|---|---|
40.9 ± 0.2 | 330. | Sokolovskii and Baev, 1984 | Based on data from 287. to 372. K.; AC |

References

Sokolovskii and Baev, 1984
Sokolovskii, A.E.; Baev, A.K.,
Russ. J. Phys. Chem., 1984, 58, 1635. [all data]
Buckingham and Donaghy, 1982
Buckingham, J.; Donaghy, S.M.,
Dictionary of Organic Compounds: Fifth Edition, Chapman and Hall, New York, 1982, 1. [all data]