Acetic acid, trifluoro-, 1,2-dimethylbutyl ester, (R*,S*)-(+/-)-
- Formula: C8H13F3O2
- Molecular weight: 198.1828
- IUPAC Standard InChIKey: SSJZIAKRAUGSQG-UHFFFAOYSA-N
- CAS Registry Number: 74454-47-0
- Chemical structure:
View 3d structure (requires JavaScript / HTML 5) - Permanent link for this species. Use this link for bookmarking this species for future reference.

Reaction thermochemistry data

Data compiled by: Hussein Y. Afeefy, Joel F. Liebman, and Stephen E. Stein
Individual Reactions
By formula: C6H12 + C2HF3O2 = C8H13F3O2
Quantity | Value | Units | Method | Reference | Comment |
---|---|---|---|---|---|
ΔrH° | -36.8 ± 0.3 | kJ/mol | Cm | Wiberg and Hao, 1991 | liquid phase; Trifluoroacetolysis |
By formula: C2HF3O2 + C6H12 = C8H13F3O2
Quantity | Value | Units | Method | Reference | Comment |
---|---|---|---|---|---|
ΔrH° | -37.7 ± 0.08 | kJ/mol | Cm | Wiberg and Hao, 1991 | liquid phase; Trifuoroacetolysis |

References

Wiberg and Hao, 1991
Wiberg, K.B.; Hao, S.,
Enthalpies of hydration of alkenes. 4. Formation of acyclic tert-alcohols,
J. Org. Chem., 1991, 56, 5108-5110. [all data]