Cyclohexanol, 2-methyl-, trans-
- Formula: C7H14O
- Molecular weight: 114.1855
- IUPAC Standard InChIKey: NDVWOBYBJYUSMF-BQBZGAKWSA-N
- CAS Registry Number: 7443-52-9
- Chemical structure:
View 3d structure (requires JavaScript / HTML 5) - Species with the same structure:
- Stereoisomers:
- Other names: trans-2-Methylcyclohexanol; 2-Methylcyclohexanol

Condensed phase thermochemistry data

Data compiled by: Hussein Y. Afeefy, Joel F. Liebman, and Stephen E. Stein
Quantity | Value | Units | Method | Reference | Comment |
---|---|---|---|---|---|
ΔfH°liquid | -421.25 | kJ/mol | Ccb | Skita and Faust, 1931 | Authors' ΔU=-9074.7±4 cal/g |
Quantity | Value | Units | Method | Reference | Comment |
ΔcH°liquid | -4322.2 ± 3.3 | kJ/mol | Ccb | Eliel and Haber, 1958 | Corresponding ΔfHºliquid = -433.17 kJ/mol (simple calculation by NIST; no Washburn corrections) |
ΔcH°liquid | -4334.2 ± 3.3 | kJ/mol | Ccb | Skita and Faust, 1931 | Authors' ΔU=-9074.7±4 cal/g; Corresponding ΔfHºliquid = -421.20 kJ/mol (simple calculation by NIST; no Washburn corrections) |

Phase change data

Data compiled by: Robert L. Brown and Stephen E. Stein
Quantity | Value | Units | Method | Reference | Comment |
---|---|---|---|---|---|
Tboil | 440.6 | K | N/A | Aldrich Chemical Company Inc., 1990 |

Reaction thermochemistry data

Data compiled as indicated in comments:
B - John E. Bartmess
ALS - Hussein Y. Afeefy, Joel F. Liebman, and Stephen E. Stein
Individual Reactions
C7H13O- + =
By formula: C7H13O- + H+ = C7H14O
Quantity | Value | Units | Method | Reference | Comment |
---|---|---|---|---|---|
ΔrH° | 1559. ± 8.4 | kJ/mol | CIDC | Haas and Harrison, 1993 | gas phase; Both metastable and 50 eV collision energy.; B |
ΔrH° | 1555. ± 9.2 | kJ/mol | G+TS | Majumdar, Clairet, et al., 1992 | gas phase; Acidity adjusted to 1987 acidity scale; B |
Quantity | Value | Units | Method | Reference | Comment |
ΔrG° | 1531. ± 8.8 | kJ/mol | H-TS | Haas and Harrison, 1993 | gas phase; Both metastable and 50 eV collision energy.; B |
ΔrG° | 1528. ± 8.8 | kJ/mol | CIDC | Majumdar, Clairet, et al., 1992 | gas phase; Acidity adjusted to 1987 acidity scale; B |
By formula: C7H14O = C7H14O
Quantity | Value | Units | Method | Reference | Comment |
---|---|---|---|---|---|
ΔrH° | 3.9 ± 0.6 | kJ/mol | Eqk | Kabo and Frenkel, 1983 | gas phase; ALS |
ΔrH° | 3.9 ± 0.6 | kJ/mol | Eqk | Frenkel and Kabo, 1979 | liquid phase; ALS |
By formula: C7H14O = H2 + C7H12O
Quantity | Value | Units | Method | Reference | Comment |
---|---|---|---|---|---|
ΔrH° | 66.6 ± 2.4 | kJ/mol | Eqk | Fedoseenko, Yursha, et al., 1983 | gas phase; At 493 K; ALS |

Gas phase ion energetics data

Data compiled by: John E. Bartmess
De-protonation reactions
C7H13O- + =
By formula: C7H13O- + H+ = C7H14O
Quantity | Value | Units | Method | Reference | Comment |
---|---|---|---|---|---|
ΔrH° | 1559. ± 8.4 | kJ/mol | CIDC | Haas and Harrison, 1993 | gas phase; Both metastable and 50 eV collision energy. |
ΔrH° | 1555. ± 9.2 | kJ/mol | G+TS | Majumdar, Clairet, et al., 1992 | gas phase; Acidity adjusted to 1987 acidity scale |
Quantity | Value | Units | Method | Reference | Comment |
ΔrG° | 1531. ± 8.8 | kJ/mol | H-TS | Haas and Harrison, 1993 | gas phase; Both metastable and 50 eV collision energy. |
ΔrG° | 1528. ± 8.8 | kJ/mol | CIDC | Majumdar, Clairet, et al., 1992 | gas phase; Acidity adjusted to 1987 acidity scale |

Kovats' RI, non-polar column, isothermal

Column type | Active phase | Temperature (C) | I | Reference | Comment |
---|---|---|---|---|---|
Packed | Apiezon L | 130. | 946. | Paris and Alexandre, 1972 | Chromosorb W AW |

Normal alkane RI, polar column, custom temperature program

Column type | Active phase | I | Reference | Comment |
---|---|---|---|---|
Capillary | DB-Wax | 1409. | Peng, Yang, et al., 1991 | Program: not specified |
Capillary | DB-Wax | 1438. | Peng, Yang, et al., 1991 | Program: not specified |

References

Skita and Faust, 1931
Skita, A.; Faust, W.,
474. Uber die Bildungs-Geschwindigkeiten der stereomeren Methyl-cyclohexanole,
Ber., 1931, 64, 2878-2892. [all data]
Eliel and Haber, 1958
Eliel, E.L.; Haber, R.G.,
The boiling points of the methylcyclohexanols-an exception to the conformational rule,
J. Org. Chem., 1958, 23, 2041. [all data]
Aldrich Chemical Company Inc., 1990
Aldrich Chemical Company Inc.,
Catalog Handbook of Fine Chemicals, Aldrich Chemical Company, Inc., Milwaukee WI, 1990, 1. [all data]
Haas and Harrison, 1993
Haas, M.J.; Harrison, A.G.,
The Fragmentation of Proton-Bound Cluster Ions and the Gas-Phase Acidities of Alcohols,
Int. J. Mass Spectrom. Ion Proc., 1993, 124, 2, 115, https://doi.org/10.1016/0168-1176(93)80003-W
. [all data]
Majumdar, Clairet, et al., 1992
Majumdar, T.K.; Clairet, F.; Tabet, J.C.; Cooks, R.G.,
PAs of halogenated uridines,
J. Am. Chem . Soc., 1992, 114, 2897. [all data]
Kabo and Frenkel, 1983
Kabo, G.J.; Frenkel, M.L.,
Thermodynamics of diastereomeric transformations of alcohols with different carbon-skeleton structures,
J. Chem. Thermodyn., 1983, 15, 377-381. [all data]
Frenkel and Kabo, 1979
Frenkel, M.L.; Kabo, G.Ya.,
Thermodynamics of stereoisomeric transformations of methylcyclohexanols,
Termodin. Org. Soedin., 1979, 104-106. [all data]
Fedoseenko, Yursha, et al., 1983
Fedoseenko, V.I.; Yursha, I.A.; Kabo, G.Ya.,
Equilibrium and thermodynamics of cyclohexanol dehydrogenation reactions,
Dokl. Akad. Nauk BSSR, 1983, 27, 926-929. [all data]
Paris and Alexandre, 1972
Paris, C.; Alexandre, P.,
Stereochemical Investigation of Cyclohexane and Terpene Compounds by Gas Chromatography,
J. Chromatogr. Sci., 1972, 10, 6, 402-411, https://doi.org/10.1093/chromsci/10.6.402
. [all data]
Peng, Yang, et al., 1991
Peng, C.T.; Yang, Z.C.; Ding, S.F.,
Prediction of rentention idexes. II. Structure-retention index relationship on polar columns,
J. Chromatogr., 1991, 586, 1, 85-112, https://doi.org/10.1016/0021-9673(91)80028-F
. [all data]