bismuth
- Formula: Bi
- Molecular weight: 208.98040
- IUPAC Standard InChIKey: JCXGWMGPZLAOME-UHFFFAOYSA-N
- CAS Registry Number: 7440-69-9
- Chemical structure:
- NIST Atomic Spectra Database - Lines Holdings (on physics web site)
- NIST Atomic Spectra Database - Levels Holdings (on physics web site)
- NIST Atomic Spectra Database - Ground states and ionization energies (on physics web site)
- Gas Phase Kinetics Database
- X-ray Photoelectron Spectroscopy Database, version 5.0

Reaction thermochemistry data

Data compiled by: John E. Bartmess
Individual Reactions
(CAS Reg. No. 121055-32-1 • 4294967295) +
= CAS Reg. No. 121055-32-1
By formula: (CAS Reg. No. 121055-32-1 • 4294967295Bi) + Bi = CAS Reg. No. 121055-32-1
Quantity | Value | Units | Method | Reference | Comment |
---|---|---|---|---|---|
ΔrH° | 226. ± 4.2 | kJ/mol | N/A | Polak, Ho, et al., 1991 | gas phase |

References

Polak, Ho, et al., 1991
Polak, M.L.; Ho, J.; Gerber, G.; Lineberger, W.C.,
Photoelectron Spectroscopy of Negatively Charged Bismuth Clusters: Bi2-, Bi3-, and Bi4-,
J. Chem. Phys., 1991, 95, 5, 3053, https://doi.org/10.1063/1.460862
. [all data]