gold
- Formula: Au
- Molecular weight: 196.966569
- IUPAC Standard InChIKey: PCHJSUWPFVWCPO-UHFFFAOYSA-N
- CAS Registry Number: 7440-57-5
- Chemical structure:
- NIST Atomic Spectra Database - Lines Holdings (on physics web site)
- NIST Atomic Spectra Database - Levels Holdings (on physics web site)
- NIST Atomic Spectra Database - Ground states and ionization energies (on physics web site)
- Gas Phase Kinetics Database
- X-ray Photoelectron Spectroscopy Database, version 5.0

Phase change data

Antoine Equation Parameters
log10(P) = A − (B / (T + C))
P = vapor pressure (bar)
T = temperature (K)
View plot Requires a JavaScript / HTML 5 canvas capable browser.
Temperature (K) | A | B | C | Reference | Comment |
---|---|---|---|---|---|
2142. to 3239. | 5.46951 | 17292.476 | -70.978 | Stull, 1947 | Coefficents calculated by NIST from author's data. |

Reaction thermochemistry data

Data compiled by: John E. Bartmess
Individual Reactions
(CAS Reg. No. 66525-34-6 • 4294967295) +
= CAS Reg. No. 66525-34-6
By formula: (CAS Reg. No. 66525-34-6 • 4294967295Au) + Au = CAS Reg. No. 66525-34-6
Quantity | Value | Units | Method | Reference | Comment |
---|---|---|---|---|---|
ΔrH° | 182. ± 12. | kJ/mol | N/A | Gantefor, Cox, et al., 1990 | gas phase |
ΔrH° | <323. ± 33. | kJ/mol | CIDT | Spasov, Shi, et al., 2000 | gas phase |
(CAS Reg. No. 124053-54-9 • 4294967295) +
= CAS Reg. No. 124053-54-9
By formula: (CAS Reg. No. 124053-54-9 • 4294967295Au) + Au = CAS Reg. No. 124053-54-9
Quantity | Value | Units | Method | Reference | Comment |
---|---|---|---|---|---|
ΔrH° | <382. ± 38. | kJ/mol | CIDT | Spasov, Shi, et al., 2000 | gas phase |
(CAS Reg. No. 130637-98-8 • 4294967295) +
= CAS Reg. No. 130637-98-8
By formula: (CAS Reg. No. 130637-98-8 • 4294967295Au) + Au = CAS Reg. No. 130637-98-8
Quantity | Value | Units | Method | Reference | Comment |
---|---|---|---|---|---|
ΔrH° | <262. ± 38. | kJ/mol | CIDT | Spasov, Shi, et al., 2000 | gas phase |
(CAS Reg. No. 140855-94-3 • 4294967295) +
= CAS Reg. No. 140855-94-3
By formula: (CAS Reg. No. 140855-94-3 • 4294967295Au) + Au = CAS Reg. No. 140855-94-3
Quantity | Value | Units | Method | Reference | Comment |
---|---|---|---|---|---|
ΔrH° | <212. ± 38. | kJ/mol | CIDT | Spasov, Shi, et al., 2000 | gas phase |
(CAS Reg. No. 140855-95-4 • 4294967295) +
= CAS Reg. No. 140855-95-4
By formula: (CAS Reg. No. 140855-95-4 • 4294967295Au) + Au = CAS Reg. No. 140855-95-4
Quantity | Value | Units | Method | Reference | Comment |
---|---|---|---|---|---|
ΔrH° | <250. ± 59. | kJ/mol | CIDT | Spasov, Shi, et al., 2000 | gas phase |
(CAS Reg. No. 140855-96-5 • 4294967295) +
= CAS Reg. No. 140855-96-5
By formula: (CAS Reg. No. 140855-96-5 • 4294967295Au) + Au = CAS Reg. No. 140855-96-5
Quantity | Value | Units | Method | Reference | Comment |
---|---|---|---|---|---|
ΔrH° | <270. ± 63. | kJ/mol | CIDT | Spasov, Shi, et al., 2000 | gas phase |

Gas phase ion energetics data

Data evaluated as indicated in comments:
L - Sharon G. Lias

Data compiled as indicated in comments:
LL - Sharon G. Lias and Joel F. Liebman
LLK - Sharon G. Lias, Rhoda D. Levin, and Sherif A. Kafafi
RDSH - Henry M. Rosenstock, Keith Draxl, Bruce W. Steiner, and John T. Herron
B - John E. Bartmess

Quantity Value Units Method Reference Comment
IE (evaluated)9.22567eVN/AN/AL

Electron affinity determinations

EA (eV) Method Reference Comment
2.3090 ± 0.0010N/AWu, Qin, et al., 2010B
2.30 ± 0.10LPESGantefor, Kraus, et al., 1998B
2.30860 ± 0.00070LPDHotop and Lineberger, 1973B
2.927 ± 0.050LPESTaylor, Pettiettehall, et al., 1992EA set as 0.2 eV above onset to correct for unresolved hot bands.; B

Ionization energy determinations

IE (eV) Method Reference Comment
9.22567EVALLide, 1992LL
9.22PEDyke, Fayad, et al., 1979LLK
9.22553 ± 0.00002SBrown and Ginter, 1978LLK
8.5 ± 0.8EICocke, Gingerich, et al., 1973LLK
9.21 ± 0.05EICabaud, Hoareau, et al., 1972LLK
9.0 ± 0.5EIGingerich and Pupp, 1971LLK
9.22567SMoore, 1970RDSH

References

Stull, 1947
Stull, Daniel R.,
Vapor Pressure of Pure Substances. Organic and Inorganic Compounds,
Ind. Eng. Chem., 1947, 39, 4, 517-540, https://doi.org/10.1021/ie50448a022
. [all data]
Gantefor, Cox, et al., 1990
Gantefor, G.F.; Cox, D.M.; Kaldor, A.,
High Resolution Photodetachment Spectroscopy of Jet-Cooled Metal Cluster Anions - Au2- and Ag3-,
J. Chem. Phys., 1990, 93, 11, 8395, https://doi.org/10.1063/1.459272
. [all data]
Spasov, Shi, et al., 2000
Spasov, V.A.; Shi, Y.; Ervin, K.M.,
Time-resolved photodissociation and threshold collision-induced dissociation of anionic gold clusters,
Chem. Phys., 2000, 262, 1, 75-91, https://doi.org/10.1016/S0301-0104(00)00165-8
. [all data]