titanium
- Formula: Ti
- Molecular weight: 47.867
- IUPAC Standard InChIKey: RTAQQCXQSZGOHL-UHFFFAOYSA-N
- CAS Registry Number: 7440-32-6
- Chemical structure:
- NIST Atomic Spectra Database - Lines Holdings (on physics web site)
- NIST Atomic Spectra Database - Levels Holdings (on physics web site)
- NIST Atomic Spectra Database - Ground states and ionization energies (on physics web site)
- Gas Phase Kinetics Database
- X-ray Photoelectron Spectroscopy Database, version 5.0
- X-ray Photoelectron Spectroscopy Database, version 5.0

Gas phase thermochemistry data

Quantity | Value | Units | Method | Reference | Comment |
---|---|---|---|---|---|
ΔfH°gas | 473. ± 3. | kJ/mol | Review | Cox, Wagman, et al., 1984 | CODATA Review value |
ΔfH°gas | 473.63 | kJ/mol | Review | Chase, 1998 | Data last reviewed in June, 1979 |
Quantity | Value | Units | Method | Reference | Comment |
S°gas,1 bar | 180.298 ± 0.010 | J/mol*K | Review | Cox, Wagman, et al., 1984 | CODATA Review value |
S°gas,1 bar | 180.30 | J/mol*K | Review | Chase, 1998 | Data last reviewed in June, 1979 |
Gas Phase Heat Capacity (Shomate Equation)
Cp° = A + B*t + C*t2 + D*t3 +
E/t2
H° − H°298.15= A*t + B*t2/2 +
C*t3/3 + D*t4/4 − E/t + F − H
S° = A*ln(t) + B*t + C*t2/2 + D*t3/3 −
E/(2*t2) + G
Cp = heat capacity (J/mol*K)
H° = standard enthalpy (kJ/mol)
S° = standard entropy (J/mol*K)
t = temperature (K) / 1000.
View plot Requires a JavaScript / HTML 5 canvas capable browser.
Temperature (K) | 3630.956 to 6000. |
---|---|
A | 9.274255 |
B | 6.092113 |
C | 0.577095 |
D | -0.110364 |
E | 6.504405 |
F | 483.0093 |
G | 204.1566 |
H | 473.6288 |
Reference | Chase, 1998 |
Comment | Data last reviewed in June, 1979 |

Condensed phase thermochemistry data

Quantity | Value | Units | Method | Reference | Comment |
---|---|---|---|---|---|
ΔfH°liquid | 13.65 | kJ/mol | Review | Chase, 1998 | Data last reviewed in June, 1979 |
Quantity | Value | Units | Method | Reference | Comment |
S°liquid,1 bar | 39.18 | J/mol*K | Review | Chase, 1998 | Data last reviewed in June, 1979 |
Quantity | Value | Units | Method | Reference | Comment |
S°solid,1 bar | 30.72 ± 0.10 | J/mol*K | Review | Cox, Wagman, et al., 1984 | CODATA Review value |
Liquid Phase Heat Capacity (Shomate Equation)
Cp° = A + B*t + C*t2 + D*t3 +
E/t2
H° − H°298.15= A*t + B*t2/2 +
C*t3/3 + D*t4/4 − E/t + F − H
S° = A*ln(t) + B*t + C*t2/2 + D*t3/3 −
E/(2*t2) + G
Cp = heat capacity (J/mol*K)
H° = standard enthalpy (kJ/mol)
S° = standard entropy (J/mol*K)
t = temperature (K) / 1000.
View plot Requires a JavaScript / HTML 5 canvas capable browser.
Temperature (K) | 1939. to 3630.956 |
---|---|
A | 47.23694 |
B | 1.975192×10-8 |
C | -5.335145×10-9 |
D | 4.904109×10-10 |
E | 1.564855×10-8 |
F | -22.05273 |
G | 66.20218 |
H | 13.65202 |
Reference | Chase, 1998 |
Comment | Data last reviewed in June, 1979 |
Solid Phase Heat Capacity (Shomate Equation)
Cp° = A + B*t + C*t2 + D*t3 +
E/t2
H° − H°298.15= A*t + B*t2/2 +
C*t3/3 + D*t4/4 − E/t + F − H
S° = A*ln(t) + B*t + C*t2/2 + D*t3/3 −
E/(2*t2) + G
Cp = heat capacity (J/mol*K)
H° = standard enthalpy (kJ/mol)
S° = standard entropy (J/mol*K)
t = temperature (K) / 1000.
View plot Requires a JavaScript / HTML 5 canvas capable browser.
Temperature (K) | 298. to 700. | 700. to 1700. | 298. to 1939. |
---|---|---|---|
A | 22.61942 | 44.37174 | 23.05660 |
B | 18.98795 | -44.09225 | 5.541331 |
C | -18.18735 | 31.70602 | -2.055881 |
D | 7.080792 | 0.052209 | 1.611745 |
E | -0.143457 | 0.036168 | -0.056075 |
F | -7.922279 | -12.72011 | -0.433228 |
G | 52.40962 | 93.08772 | 64.12691 |
H | 0.000000 | 0.000000 | 6.860003 |
Reference | Chase, 1998 | Chase, 1998 | Chase, 1998 |
Comment | α phase; Data last reviewed in June, 1979 | α phase; Data last reviewed in June, 1979 | β phase; Data last reviewed in June, 1979 |

Reaction thermochemistry data

Data compiled by: Michael M. Meot-Ner (Mautner) and Sharon G. Lias
Individual Reactions
By formula: (Ti+ • 11Ti) + Ti = (Ti+ • 12Ti)
Enthalpy of reaction
ΔrH° (kJ/mol) | T (K) | Method | Reference | Comment |
---|---|---|---|---|
469.9 | CID | Armentrout and Kickel, 1994 | gas phase; guided ion beam CID |
By formula: (Ti+ • 17Ti) + Ti = (Ti+ • 18Ti)
Enthalpy of reaction
ΔrH° (kJ/mol) | T (K) | Method | Reference | Comment |
---|---|---|---|---|
449.8 | CID | Armentrout and Kickel, 1994 | gas phase; guided ion beam CID |
By formula: (Ti+ • 10Ti) + Ti = (Ti+ • 11Ti)
Enthalpy of reaction
ΔrH° (kJ/mol) | T (K) | Method | Reference | Comment |
---|---|---|---|---|
406. | CID | Armentrout and Kickel, 1994 | gas phase; guided ion beam CID |
By formula: (Ti+ • 12Ti) + Ti = (Ti+ • 13Ti)
Enthalpy of reaction
ΔrH° (kJ/mol) | T (K) | Method | Reference | Comment |
---|---|---|---|---|
321. | CID | Armentrout and Kickel, 1994 | gas phase; guided ion beam CID |
By formula: (Ti+ • 13Ti) + Ti = (Ti+ • 14Ti)
Enthalpy of reaction
ΔrH° (kJ/mol) | T (K) | Method | Reference | Comment |
---|---|---|---|---|
400. | CID | Armentrout and Kickel, 1994 | gas phase; guided ion beam CID |
By formula: (Ti+ • 14Ti) + Ti = (Ti+ • 15Ti)
Enthalpy of reaction
ΔrH° (kJ/mol) | T (K) | Method | Reference | Comment |
---|---|---|---|---|
360. | CID | Armentrout and Kickel, 1994 | gas phase; guided ion beam CID |
By formula: (Ti+ • 15Ti) + Ti = (Ti+ • 16Ti)
Enthalpy of reaction
ΔrH° (kJ/mol) | T (K) | Method | Reference | Comment |
---|---|---|---|---|
344. | CID | Armentrout and Kickel, 1994 | gas phase; guided ion beam CID |
By formula: (Ti+ • 16Ti) + Ti = (Ti+ • 17Ti)
Enthalpy of reaction
ΔrH° (kJ/mol) | T (K) | Method | Reference | Comment |
---|---|---|---|---|
318. | CID | Armentrout and Kickel, 1994 | gas phase; guided ion beam CID |
By formula: (Ti+ • 18Ti) + Ti = (Ti+ • 19Ti)
Enthalpy of reaction
ΔrH° (kJ/mol) | T (K) | Method | Reference | Comment |
---|---|---|---|---|
409. | CID | Armentrout and Kickel, 1994 | gas phase; guided ion beam CID |
By formula: (Ti+ • 19Ti) + Ti = (Ti+ • 20Ti)
Enthalpy of reaction
ΔrH° (kJ/mol) | T (K) | Method | Reference | Comment |
---|---|---|---|---|
395. | CID | Armentrout and Kickel, 1994 | gas phase; guided ion beam CID |
By formula: (Ti+ • 20Ti) + Ti = (Ti+ • 21Ti)
Enthalpy of reaction
ΔrH° (kJ/mol) | T (K) | Method | Reference | Comment |
---|---|---|---|---|
410. | CID | Armentrout and Kickel, 1994 | gas phase; guided ion beam CID |
By formula: (Ti+ • 9Ti) + Ti = (Ti+ • 10Ti)
Enthalpy of reaction
ΔrH° (kJ/mol) | T (K) | Method | Reference | Comment |
---|---|---|---|---|
344. | CID | Armentrout and Kickel, 1994 | gas phase; guided ion beam CID |
By formula: (Ti+ • 2Ti) + Ti = (Ti+ • 3Ti)
Enthalpy of reaction
ΔrH° (kJ/mol) | T (K) | Method | Reference | Comment |
---|---|---|---|---|
338. | CID | Armentrout and Kickel, 1994 | gas phase; guided ion beam CID |
By formula: (Ti+ • 3Ti) + Ti = (Ti+ • 4Ti)
Enthalpy of reaction
ΔrH° (kJ/mol) | T (K) | Method | Reference | Comment |
---|---|---|---|---|
340. | CID | Armentrout and Kickel, 1994 | gas phase; guided ion beam CID |
By formula: (Ti+ • 4Ti) + Ti = (Ti+ • 5Ti)
Enthalpy of reaction
ΔrH° (kJ/mol) | T (K) | Method | Reference | Comment |
---|---|---|---|---|
354. | CID | Armentrout and Kickel, 1994 | gas phase; guided ion beam CID |
By formula: (Ti+ • 5Ti) + Ti = (Ti+ • 6Ti)
Enthalpy of reaction
ΔrH° (kJ/mol) | T (K) | Method | Reference | Comment |
---|---|---|---|---|
400. | CID | Armentrout and Kickel, 1994 | gas phase; guided ion beam CID |
By formula: (Ti+ • 6Ti) + Ti = (Ti+ • 7Ti)
Enthalpy of reaction
ΔrH° (kJ/mol) | T (K) | Method | Reference | Comment |
---|---|---|---|---|
278. | CID | Armentrout and Kickel, 1994 | gas phase; guided ion beam CID |
By formula: (Ti+ • 7Ti) + Ti = (Ti+ • 8Ti)
Enthalpy of reaction
ΔrH° (kJ/mol) | T (K) | Method | Reference | Comment |
---|---|---|---|---|
346. | CID | Armentrout and Kickel, 1994 | gas phase; guided ion beam CID |
By formula: (Ti+ • 8Ti) + Ti = (Ti+ • 9Ti)
Enthalpy of reaction
ΔrH° (kJ/mol) | T (K) | Method | Reference | Comment |
---|---|---|---|---|
335. | CID | Armentrout and Kickel, 1994 | gas phase; guided ion beam CID |
By formula: (Ti+ • Ti) + Ti = (Ti+ • 2Ti)
Enthalpy of reaction
ΔrH° (kJ/mol) | T (K) | Method | Reference | Comment |
---|---|---|---|---|
230. | CID | Armentrout and Kickel, 1994 | gas phase; guided ion beam CID |
By formula: Ti+ + Ti = (Ti+ • Ti)
Enthalpy of reaction
ΔrH° (kJ/mol) | T (K) | Method | Reference | Comment |
---|---|---|---|---|
244. | CID | Armentrout and Kickel, 1994 | gas phase; guided ion beam CID |

Gas phase ion energetics data

Data evaluated as indicated in comments:
HL - Edward P. Hunter and Sharon G. Lias
L - Sharon G. Lias
Data compiled as indicated in comments:
LL - Sharon G. Lias and Joel F. Liebman
LBLHLM - Sharon G. Lias, John E. Bartmess, Joel F. Liebman, John L. Holmes, Rhoda D. Levin, and W. Gary Mallard
LLK - Sharon G. Lias, Rhoda D. Levin, and Sherif A. Kafafi
RDSH - Henry M. Rosenstock, Keith Draxl, Bruce W. Steiner, and John T. Herron
B - John E. Bartmess
Quantity | Value | Units | Method | Reference | Comment |
---|---|---|---|---|---|
IE (evaluated) | 6.8282 | eV | N/A | N/A | L |
Quantity | Value | Units | Method | Reference | Comment |
Proton affinity (review) | 876. | kJ/mol | N/A | Hunter and Lias, 1998 | HL |
Quantity | Value | Units | Method | Reference | Comment |
Gas basicity | 853.7 | kJ/mol | N/A | Hunter and Lias, 1998 | HL |
Electron affinity determinations
EA (eV) | Method | Reference | Comment |
---|---|---|---|
0.0870 ± 0.0070 | EFD | Ilin, Sakharov, et al., 1987 | B |
0.080 ± 0.014 | LPES | Feigerle, Corderman, et al., 1981 | B |
Ionization energy determinations
IE (eV) | Method | Reference | Comment |
---|---|---|---|
6.8282 | EVAL | Lide, 1992 | LL |
6.8282 | LS | Page and Gudeman, 1990 | LL |
6.82 | S | Kelly, 1987 | LBLHLM |
6.820 ± 0.006 | S | Sugar and Corliss, 1985 | LBLHLM |
6.01 | PE | Dyke, Gravenor, et al., 1984 | LBLHLM |
6.8 ± 0.2 | EI | Banon, Chatillon, et al., 1982 | LBLHLM |
6.78 ± 0.02 | EI | Rauh and Ackermann, 1979 | LLK |
6.7 | EI | Hildenbrand, 1977 | LLK |
6.8 ± 0.1 | EI | Rauh and Ackermann, 1974 | LLK |
7.3 ± 0.6 | EI | Cocke and Gingerich, 1974 | LLK |
7.3 ± 0.6 | EI | Cocke and Gingerich, 1972 | LLK |
7.4 ± 0.5 | EI | Balducci, De Maria, et al., 1972 | LLK |
6.6 ± 0.5 | EI | Edwards, Franzen, et al., 1971 | LLK |
6.8204 | S | Moore, 1970 | RDSH |
6.6 ± 0.2 | EI | Mesnard, Uzan, et al., 1966 | RDSH |

Ion clustering data

Data compiled by: Michael M. Meot-Ner (Mautner) and Sharon G. Lias

Clustering reactions

Titanium ion (1+) + titanium = (Titanium ion (1+) • titanium)

By formula: Ti+ + Ti = (Ti+ • Ti)

Enthalpy of reaction

ΔrH° (kJ/mol) T (K) Method Reference Comment
244. CIDArmentrout and Kickel, 1994gas phase; guided ion beam CID

(Titanium ion (1+) • titanium) + titanium = (Titanium ion (1+) • 2titanium)

By formula: (Ti+ • Ti) + Ti = (Ti+ • 2Ti)

Enthalpy of reaction

ΔrH° (kJ/mol) T (K) Method Reference Comment
230. CIDArmentrout and Kickel, 1994gas phase; guided ion beam CID

(Titanium ion (1+) • 2titanium) + titanium = (Titanium ion (1+) • 3titanium)

By formula: (Ti+ • 2Ti) + Ti = (Ti+ • 3Ti)

Enthalpy of reaction

ΔrH° (kJ/mol) T (K) Method Reference Comment
338. CIDArmentrout and Kickel, 1994gas phase; guided ion beam CID

(Titanium ion (1+) • 3titanium) + titanium = (Titanium ion (1+) • 4titanium)

By formula: (Ti+ • 3Ti) + Ti = (Ti+ • 4Ti)

Enthalpy of reaction

ΔrH° (kJ/mol) T (K) Method Reference Comment
340. CIDArmentrout and Kickel, 1994gas phase; guided ion beam CID

(Titanium ion (1+) • 4titanium) + titanium = (Titanium ion (1+) • 5titanium)

By formula: (Ti+ • 4Ti) + Ti = (Ti+ • 5Ti)

Enthalpy of reaction

ΔrH° (kJ/mol) T (K) Method Reference Comment
354. CIDArmentrout and Kickel, 1994gas phase; guided ion beam CID

(Titanium ion (1+) • 5titanium) + titanium = (Titanium ion (1+) • 6titanium)

By formula: (Ti+ • 5Ti) + Ti = (Ti+ • 6Ti)

Enthalpy of reaction

ΔrH° (kJ/mol) T (K) Method Reference Comment
400. CIDArmentrout and Kickel, 1994gas phase; guided ion beam CID

(Titanium ion (1+) • 6titanium) + titanium = (Titanium ion (1+) • 7titanium)

By formula: (Ti+ • 6Ti) + Ti = (Ti+ • 7Ti)

Enthalpy of reaction

ΔrH° (kJ/mol) T (K) Method Reference Comment
278. CIDArmentrout and Kickel, 1994gas phase; guided ion beam CID

(Titanium ion (1+) • 7titanium) + titanium = (Titanium ion (1+) • 8titanium)

By formula: (Ti+ • 7Ti) + Ti = (Ti+ • 8Ti)

Enthalpy of reaction

ΔrH° (kJ/mol) T (K) Method Reference Comment
346. CIDArmentrout and Kickel, 1994gas phase; guided ion beam CID

(Titanium ion (1+) • 8titanium) + titanium = (Titanium ion (1+) • 9titanium)

By formula: (Ti+ • 8Ti) + Ti = (Ti+ • 9Ti)

Enthalpy of reaction

ΔrH° (kJ/mol) T (K) Method Reference Comment
335. CIDArmentrout and Kickel, 1994gas phase; guided ion beam CID

(Titanium ion (1+) • 9titanium) + titanium = (Titanium ion (1+) • 10titanium)

By formula: (Ti+ • 9Ti) + Ti = (Ti+ • 10Ti)

Enthalpy of reaction

ΔrH° (kJ/mol) T (K) Method Reference Comment
344. CIDArmentrout and Kickel, 1994gas phase; guided ion beam CID

(Titanium ion (1+) • 10titanium) + titanium = (Titanium ion (1+) • 11titanium)

By formula: (Ti+ • 10Ti) + Ti = (Ti+ • 11Ti)

Enthalpy of reaction

ΔrH° (kJ/mol) T (K) Method Reference Comment
406. CIDArmentrout and Kickel, 1994gas phase; guided ion beam CID

(Titanium ion (1+) • 11titanium) + titanium = (Titanium ion (1+) • 12titanium)

By formula: (Ti+ • 11Ti) + Ti = (Ti+ • 12Ti)

Enthalpy of reaction

ΔrH° (kJ/mol) T (K) Method Reference Comment
469.9 CIDArmentrout and Kickel, 1994gas phase; guided ion beam CID

(Titanium ion (1+) • 12titanium) + titanium = (Titanium ion (1+) • 13titanium)

By formula: (Ti+ • 12Ti) + Ti = (Ti+ • 13Ti)

Enthalpy of reaction

ΔrH° (kJ/mol) T (K) Method Reference Comment
321. CIDArmentrout and Kickel, 1994gas phase; guided ion beam CID

(Titanium ion (1+) • 13titanium) + titanium = (Titanium ion (1+) • 14titanium)

By formula: (Ti+ • 13Ti) + Ti = (Ti+ • 14Ti)

Enthalpy of reaction

ΔrH° (kJ/mol) T (K) Method Reference Comment
400. CIDArmentrout and Kickel, 1994gas phase; guided ion beam CID

(Titanium ion (1+) • 14titanium) + titanium = (Titanium ion (1+) • 15titanium)

By formula: (Ti+ • 14Ti) + Ti = (Ti+ • 15Ti)

Enthalpy of reaction

ΔrH° (kJ/mol) T (K) Method Reference Comment
360. CIDArmentrout and Kickel, 1994gas phase; guided ion beam CID

(Titanium ion (1+) • 15titanium) + titanium = (Titanium ion (1+) • 16titanium)

By formula: (Ti+ • 15Ti) + Ti = (Ti+ • 16Ti)

Enthalpy of reaction

ΔrH° (kJ/mol) T (K) Method Reference Comment
344. CIDArmentrout and Kickel, 1994gas phase; guided ion beam CID

(Titanium ion (1+) • 16titanium) + titanium = (Titanium ion (1+) • 17titanium)

By formula: (Ti+ • 16Ti) + Ti = (Ti+ • 17Ti)

Enthalpy of reaction

ΔrH° (kJ/mol) T (K) Method Reference Comment
318. CIDArmentrout and Kickel, 1994gas phase; guided ion beam CID

(Titanium ion (1+) • 17titanium) + titanium = (Titanium ion (1+) • 18titanium)

By formula: (Ti+ • 17Ti) + Ti = (Ti+ • 18Ti)

Enthalpy of reaction

ΔrH° (kJ/mol) T (K) Method Reference Comment
449.8 CIDArmentrout and Kickel, 1994gas phase; guided ion beam CID

(Titanium ion (1+) • 18titanium) + titanium = (Titanium ion (1+) • 19titanium)

By formula: (Ti+ • 18Ti) + Ti = (Ti+ • 19Ti)

Enthalpy of reaction

ΔrH° (kJ/mol) T (K) Method Reference Comment
409. CIDArmentrout and Kickel, 1994gas phase; guided ion beam CID

(Titanium ion (1+) • 19titanium) + titanium = (Titanium ion (1+) • 20titanium)

By formula: (Ti+ • 19Ti) + Ti = (Ti+ • 20Ti)

Enthalpy of reaction

ΔrH° (kJ/mol) T (K) Method Reference Comment
395. CIDArmentrout and Kickel, 1994gas phase; guided ion beam CID

(Titanium ion (1+) • 20titanium) + titanium = (Titanium ion (1+) • 21titanium)

By formula: (Ti+ • 20Ti) + Ti = (Ti+ • 21Ti)

Enthalpy of reaction

ΔrH° (kJ/mol) T (K) Method Reference Comment
410. CIDArmentrout and Kickel, 1994gas phase; guided ion beam CID

References

Cox, Wagman, et al., 1984
Cox, J.D.; Wagman, D.D.; Medvedev, V.A.,
CODATA Key Values for Thermodynamics, Hemisphere Publishing Corp., New York, 1984, 1. [all data]
Chase, 1998
Chase, M.W., Jr.,
NIST-JANAF Themochemical Tables, Fourth Edition,
J. Phys. Chem. Ref. Data, Monograph 9, 1998, 1-1951. [all data]
Armentrout and Kickel, 1994
Armentrout, P.B.; Kickel, B.L.,
Gas Phase Thermochemistry of Transition Metal Ligand Systems: Reassessment of Values and Periodic Trends, in Organometallic Ion Chemistry, B. S. Freiser, ed, 1994. [all data]