potassium
- Formula: K
- Molecular weight: 39.0983
- IUPAC Standard InChIKey: ZLMJMSJWJFRBEC-UHFFFAOYSA-N
- CAS Registry Number: 7440-09-7
- Chemical structure:
- NIST Atomic Spectra Database - Lines Holdings (on physics web site)
- NIST Atomic Spectra Database - Levels Holdings (on physics web site)
- NIST Atomic Spectra Database - Ground states and ionization energies (on physics web site)
- Gas Phase Kinetics Database
- X-ray Photoelectron Spectroscopy Database, version 5.0

Gas phase thermochemistry data

Quantity | Value | Units | Method | Reference | Comment |
---|---|---|---|---|---|
ΔfH°gas | 89.0 ± 0.8 | kJ/mol | Review | Cox, Wagman, et al., 1984 | CODATA Review value |
ΔfH°gas | 89.00 | kJ/mol | Review | Chase, 1998 | Data last reviewed in December, 1961 |
Quantity | Value | Units | Method | Reference | Comment |
S°gas,1 bar | 160.341 ± 0.003 | J/mol*K | Review | Cox, Wagman, et al., 1984 | CODATA Review value |
S°gas,1 bar | 160.34 | J/mol*K | Review | Chase, 1998 | Data last reviewed in December, 1961 |
Gas Phase Heat Capacity (Shomate Equation)
Cp° = A + B*t + C*t2 + D*t3 +
E/t2
H° − H°298.15= A*t + B*t2/2 +
C*t3/3 + D*t4/4 − E/t + F − H
S° = A*ln(t) + B*t + C*t2/2 + D*t3/3 −
E/(2*t2) + G
Cp = heat capacity (J/mol*K)
H° = standard enthalpy (kJ/mol)
S° = standard entropy (J/mol*K)
t = temperature (K) / 1000.
View plot Requires a JavaScript / HTML 5 canvas capable browser.
Temperature (K) | 1039.54 to 1800. | 1800. to 6000. |
---|---|---|
A | 20.66122 | 58.70570 |
B | 0.391869 | -27.38277 |
C | -0.417344 | 6.730509 |
D | 0.145582 | -0.420844 |
E | 0.003764 | -25.87921 |
F | 82.83860 | 32.37931 |
G | 185.2650 | 198.3777 |
H | 88.99996 | 88.99996 |
Reference | Chase, 1998 | Chase, 1998 |
Comment | Data last reviewed in December, 1961 | Data last reviewed in December, 1961 |

Condensed phase thermochemistry data

Quantity | Value | Units | Method | Reference | Comment |
---|---|---|---|---|---|
ΔfH°liquid | 2.27 | kJ/mol | Review | Chase, 1998 | Data last reviewed in December, 1961 |
Quantity | Value | Units | Method | Reference | Comment |
S°liquid,1 bar | 71.40 | J/mol*K | Review | Chase, 1998 | Data last reviewed in December, 1961 |
Quantity | Value | Units | Method | Reference | Comment |
S°solid,1 bar | 64.68 ± 0.20 | J/mol*K | Review | Cox, Wagman, et al., 1984 | CODATA Review value |
Quantity | Value | Units | Method | Reference | Comment |
S°solid | 64.63 | J/mol*K | Review | Chase, 1998 | Data last reviewed in December, 1961 |
Liquid Phase Heat Capacity (Shomate Equation)
Cp° = A + B*t + C*t2 + D*t3 +
E/t2
H° − H°298.15= A*t + B*t2/2 +
C*t3/3 + D*t4/4 − E/t + F − H
S° = A*ln(t) + B*t + C*t2/2 + D*t3/3 −
E/(2*t2) + G
Cp = heat capacity (J/mol*K)
H° = standard enthalpy (kJ/mol)
S° = standard entropy (J/mol*K)
t = temperature (K) / 1000.
View plot Requires a JavaScript / HTML 5 canvas capable browser.
Temperature (K) | 336.35 to 1039.54 |
---|---|
A | 40.27113 |
B | -30.54542 |
C | 26.49505 |
D | -5.727854 |
E | -0.063477 |
F | -8.812467 |
G | 127.7614 |
H | 2.270005 |
Reference | Chase, 1998 |
Comment | Data last reviewed in December, 1961 |
Solid Phase Heat Capacity (Shomate Equation)
Cp° = A + B*t + C*t2 + D*t3 +
E/t2
H° − H°298.15= A*t + B*t2/2 +
C*t3/3 + D*t4/4 − E/t + F − H
S° = A*ln(t) + B*t + C*t2/2 + D*t3/3 −
E/(2*t2) + G
Cp = heat capacity (J/mol*K)
H° = standard enthalpy (kJ/mol)
S° = standard entropy (J/mol*K)
t = temperature (K) / 1000.
View plot Requires a JavaScript / HTML 5 canvas capable browser.
Temperature (K) | 298. to 336.35 |
---|---|
A | -63.47410 |
B | -3226.340 |
C | 14644.60 |
D | -16229.50 |
E | 16.29410 |
F | 119.6480 |
G | 533.8780 |
H | 0.000000 |
Reference | Chase, 1998 |
Comment | Data last reviewed in December, 1961 |

Phase change data

Data compiled as indicated in comments:
TRC - Thermodynamics Research Center, NIST Boulder Laboratories, Chris Muzny director
Quantity | Value | Units | Method | Reference | Comment |
---|---|---|---|---|---|
Tboil | 1037. | K | N/A | Honig and Kramer, 1969 | Uncertainty assigned by TRC = 1. K; TRC |
Quantity | Value | Units | Method | Reference | Comment |
Ttriple | 336.35 | K | N/A | Honig and Kramer, 1969 | Uncertainty assigned by TRC = 0.1 K; TRC |
Antoine Equation Parameters
log10(P) = A − (B / (T + C))
P = vapor pressure (bar)
T = temperature (K)
View plot Requires a JavaScript / HTML 5 canvas capable browser.
Temperature (K) | A | B | C | Reference | Comment |
---|---|---|---|---|---|
679.4 to 1033.0 | 4.45718 | 4691.58 | 24.195 | Fiock and Rodebush, 1926 | Coefficents calculated by NIST from author's data. |

Ion clustering data

Data compiled by: Michael M. Meot-Ner (Mautner) and Sharon G. Lias
Clustering reactions
By formula: (K+ • 2K) + K = (K+ • 3K)
Quantity | Value | Units | Method | Reference | Comment |
---|---|---|---|---|---|
ΔrH° | 43.5 | kJ/mol | PDiss | Brechignac, Cahuzac, et al., 1990 | gas phase |
By formula: (K+ • 3K) + K = (K+ • 4K)
Quantity | Value | Units | Method | Reference | Comment |
---|---|---|---|---|---|
ΔrH° | 64.9 | kJ/mol | PDiss | Brechignac, Cahuzac, et al., 1990 | gas phase |
By formula: (K+ • 4K) + K = (K+ • 5K)
Quantity | Value | Units | Method | Reference | Comment |
---|---|---|---|---|---|
ΔrH° | 52.3 | kJ/mol | PDiss | Brechignac, Cahuzac, et al., 1990 | gas phase |
By formula: (K+ • 5K) + K = (K+ • 6K)
Quantity | Value | Units | Method | Reference | Comment |
---|---|---|---|---|---|
ΔrH° | 72.4 | kJ/mol | PDiss | Brechignac, Cahuzac, et al., 1990 | gas phase |
By formula: (K+ • 6K) + K = (K+ • 7K)
Quantity | Value | Units | Method | Reference | Comment |
---|---|---|---|---|---|
ΔrH° | 56.1 | kJ/mol | PDiss | Brechignac, Cahuzac, et al., 1990 | gas phase |
By formula: (K+ • 7K) + K = (K+ • 8K)
Quantity | Value | Units | Method | Reference | Comment |
---|---|---|---|---|---|
ΔrH° | 87.0 | kJ/mol | PDiss | Brechignac, Cahuzac, et al., 1990 | gas phase |
By formula: (K+ • 8K) + K = (K+ • 9K)
Quantity | Value | Units | Method | Reference | Comment |
---|---|---|---|---|---|
ΔrH° | 48.1 | kJ/mol | PDiss | Brechignac, Cahuzac, et al., 1990 | gas phase |
By formula: (K+ • 9K) + K = (K+ • 10K)
Quantity | Value | Units | Method | Reference | Comment |
---|---|---|---|---|---|
ΔrH° | 54.8 | kJ/mol | PDiss | Brechignac, Cahuzac, et al., 1990 | gas phase |
By formula: (K+ • 10K) + K = (K+ • 11K)
Quantity | Value | Units | Method | Reference | Comment |
---|---|---|---|---|---|
ΔrH° | 54.0 | kJ/mol | PDiss | Brechignac, Cahuzac, et al., 1990 | gas phase |
By formula: (K+ • 11K) + K = (K+ • 12K)
Quantity | Value | Units | Method | Reference | Comment |
---|---|---|---|---|---|
ΔrH° | 56.1 | kJ/mol | PDiss | Brechignac, Cahuzac, et al., 1990 | gas phase |
By formula: (K+ • 12K) + K = (K+ • 13K)
Quantity | Value | Units | Method | Reference | Comment |
---|---|---|---|---|---|
ΔrH° | 56.1 | kJ/mol | PDiss | Brechignac, Cahuzac, et al., 1990 | gas phase |
By formula: (K+ • 13K) + K = (K+ • 14K)
Quantity | Value | Units | Method | Reference | Comment |
---|---|---|---|---|---|
ΔrH° | 62.3 | kJ/mol | PDiss | Brechignac, Cahuzac, et al., 1990 | gas phase |
By formula: (K+ • 14K) + K = (K+ • 15K)
Quantity | Value | Units | Method | Reference | Comment |
---|---|---|---|---|---|
ΔrH° | 54.8 | kJ/mol | PDiss | Brechignac, Cahuzac, et al., 1990 | gas phase |
By formula: (K+ • 15K) + K = (K+ • 16K)
Quantity | Value | Units | Method | Reference | Comment |
---|---|---|---|---|---|
ΔrH° | 62.8 | kJ/mol | PDiss | Brechignac, Cahuzac, et al., 1990 | gas phase |
By formula: (K+ • 16K) + K = (K+ • 17K)
Quantity | Value | Units | Method | Reference | Comment |
---|---|---|---|---|---|
ΔrH° | 64.9 | kJ/mol | PDiss | Brechignac, Cahuzac, et al., 1990 | gas phase |
By formula: (K+ • 17K) + K = (K+ • 18K)
Quantity | Value | Units | Method | Reference | Comment |
---|---|---|---|---|---|
ΔrH° | 67.4 | kJ/mol | PDiss | Brechignac, Cahuzac, et al., 1990 | gas phase |
By formula: (K+ • 18K) + K = (K+ • 19K)
Quantity | Value | Units | Method | Reference | Comment |
---|---|---|---|---|---|
ΔrH° | 65.7 | kJ/mol | PDiss | Brechignac, Cahuzac, et al., 1990 | gas phase |
By formula: (K+ • 19K) + K = (K+ • 20K)
Quantity | Value | Units | Method | Reference | Comment |
---|---|---|---|---|---|
ΔrH° | 72.4 | kJ/mol | PDiss | Brechignac, Cahuzac, et al., 1990 | gas phase |
By formula: (K+ • 20K) + K = (K+ • 21K)
Quantity | Value | Units | Method | Reference | Comment |
---|---|---|---|---|---|
ΔrH° | 54.0 | kJ/mol | PDiss | Brechignac, Cahuzac, et al., 1990 | gas phase |
By formula: (K+ • 21K) + K = (K+ • 22K)
Quantity | Value | Units | Method | Reference | Comment |
---|---|---|---|---|---|
ΔrH° | 59.8 | kJ/mol | PDiss | Brechignac, Cahuzac, et al., 1990 | gas phase |
By formula: (K+ • 22K) + K = (K+ • 23K)
Quantity | Value | Units | Method | Reference | Comment |
---|---|---|---|---|---|
ΔrH° | 56.9 | kJ/mol | PDiss | Brechignac, Cahuzac, et al., 1990 | gas phase |
By formula: (K+ • 23K) + K = (K+ • 24K)
Quantity | Value | Units | Method | Reference | Comment |
---|---|---|---|---|---|
ΔrH° | 61.9 | kJ/mol | PDiss | Brechignac, Cahuzac, et al., 1990 | gas phase |

Gas phase ion energetics data

Data evaluated as indicated in comments:
L - Sharon G. Lias
Data compiled as indicated in comments:
LL - Sharon G. Lias and Joel F. Liebman
LBLHLM - Sharon G. Lias, John E. Bartmess, Joel F. Liebman, John L. Holmes, Rhoda D. Levin, and W. Gary Mallard
LLK - Sharon G. Lias, Rhoda D. Levin, and Sherif A. Kafafi
RDSH - Henry M. Rosenstock, Keith Draxl, Bruce W. Steiner, and John T. Herron
Quantity | Value | Units | Method | Reference | Comment |
---|---|---|---|---|---|
IE (evaluated) | 4.34066 ± 0.00001 | eV | N/A | N/A | L |
Ionization energy determinations
IE (eV) | Method | Reference | Comment |
---|---|---|---|
4.34066 | EVAL | Lide, 1992 | LL |
4.34066 | S | Kelly, 1987 | LBLHLM |
4.34066 ± 0.00001 | S | Sugar and Corliss, 1985 | LBLHLM |
4.5 ± 1.0 | S | Farber, Srivastava, et al., 1982 | LBLHLM |
4.4 | EI | Zmbov, Wu, et al., 1977 | LLK |
4.1 ± 0.3 | EI | Simmons, Lowden, et al., 1977 | LLK |
4.34 | PE | Williams and Potts, 1976 | LLK |
4.34066 | S | Moore, 1970 | RDSH |

Reaction thermochemistry data

Data compiled by: Michael M. Meot-Ner (Mautner) and Sharon G. Lias
Individual Reactions
By formula: (K+ • 10K) + K = (K+ • 11K)
Quantity | Value | Units | Method | Reference | Comment |
---|---|---|---|---|---|
ΔrH° | 12.9 | kcal/mol | PDiss | Brechignac, Cahuzac, et al., 1990 | gas phase |
By formula: (K+ • 11K) + K = (K+ • 12K)
Quantity | Value | Units | Method | Reference | Comment |
---|---|---|---|---|---|
ΔrH° | 13.4 | kcal/mol | PDiss | Brechignac, Cahuzac, et al., 1990 | gas phase |
By formula: (K+ • 12K) + K = (K+ • 13K)
Quantity | Value | Units | Method | Reference | Comment |
---|---|---|---|---|---|
ΔrH° | 13.4 | kcal/mol | PDiss | Brechignac, Cahuzac, et al., 1990 | gas phase |
By formula: (K+ • 13K) + K = (K+ • 14K)
Quantity | Value | Units | Method | Reference | Comment |
---|---|---|---|---|---|
ΔrH° | 14.9 | kcal/mol | PDiss | Brechignac, Cahuzac, et al., 1990 | gas phase |
By formula: (K+ • 14K) + K = (K+ • 15K)
Quantity | Value | Units | Method | Reference | Comment |
---|---|---|---|---|---|
ΔrH° | 13.1 | kcal/mol | PDiss | Brechignac, Cahuzac, et al., 1990 | gas phase |
By formula: (K+ • 15K) + K = (K+ • 16K)
Quantity | Value | Units | Method | Reference | Comment |
---|---|---|---|---|---|
ΔrH° | 15.0 | kcal/mol | PDiss | Brechignac, Cahuzac, et al., 1990 | gas phase |
By formula: (K+ • 16K) + K = (K+ • 17K)
Quantity | Value | Units | Method | Reference | Comment |
---|---|---|---|---|---|
ΔrH° | 15.5 | kcal/mol | PDiss | Brechignac, Cahuzac, et al., 1990 | gas phase |
By formula: (K+ • 17K) + K = (K+ • 18K)
Quantity | Value | Units | Method | Reference | Comment |
---|---|---|---|---|---|
ΔrH° | 16.1 | kcal/mol | PDiss | Brechignac, Cahuzac, et al., 1990 | gas phase |
By formula: (K+ • 18K) + K = (K+ • 19K)
Quantity | Value | Units | Method | Reference | Comment |
---|---|---|---|---|---|
ΔrH° | 15.7 | kcal/mol | PDiss | Brechignac, Cahuzac, et al., 1990 | gas phase |
By formula: (K+ • 19K) + K = (K+ • 20K)
Quantity | Value | Units | Method | Reference | Comment |
---|---|---|---|---|---|
ΔrH° | 17.3 | kcal/mol | PDiss | Brechignac, Cahuzac, et al., 1990 | gas phase |
By formula: (K+ • 20K) + K = (K+ • 21K)
Quantity | Value | Units | Method | Reference | Comment |
---|---|---|---|---|---|
ΔrH° | 12.9 | kcal/mol | PDiss | Brechignac, Cahuzac, et al., 1990 | gas phase |
By formula: (K+ • 21K) + K = (K+ • 22K)
Quantity | Value | Units | Method | Reference | Comment |
---|---|---|---|---|---|
ΔrH° | 14.3 | kcal/mol | PDiss | Brechignac, Cahuzac, et al., 1990 | gas phase |
By formula: (K+ • 22K) + K = (K+ • 23K)
Quantity | Value | Units | Method | Reference | Comment |
---|---|---|---|---|---|
ΔrH° | 13.6 | kcal/mol | PDiss | Brechignac, Cahuzac, et al., 1990 | gas phase |
By formula: (K+ • 23K) + K = (K+ • 24K)
Quantity | Value | Units | Method | Reference | Comment |
---|---|---|---|---|---|
ΔrH° | 14.8 | kcal/mol | PDiss | Brechignac, Cahuzac, et al., 1990 | gas phase |
By formula: (K+ • 9K) + K = (K+ • 10K)
Quantity | Value | Units | Method | Reference | Comment |
---|---|---|---|---|---|
ΔrH° | 13.1 | kcal/mol | PDiss | Brechignac, Cahuzac, et al., 1990 | gas phase |
By formula: (K+ • 2K) + K = (K+ • 3K)
Quantity | Value | Units | Method | Reference | Comment |
---|---|---|---|---|---|
ΔrH° | 10.4 | kcal/mol | PDiss | Brechignac, Cahuzac, et al., 1990 | gas phase |
By formula: (K+ • 3K) + K = (K+ • 4K)
Quantity | Value | Units | Method | Reference | Comment |
---|---|---|---|---|---|
ΔrH° | 15.5 | kcal/mol | PDiss | Brechignac, Cahuzac, et al., 1990 | gas phase |
By formula: (K+ • 4K) + K = (K+ • 5K)
Quantity | Value | Units | Method | Reference | Comment |
---|---|---|---|---|---|
ΔrH° | 12.5 | kcal/mol | PDiss | Brechignac, Cahuzac, et al., 1990 | gas phase |
By formula: (K+ • 5K) + K = (K+ • 6K)
Quantity | Value | Units | Method | Reference | Comment |
---|---|---|---|---|---|
ΔrH° | 17.3 | kcal/mol | PDiss | Brechignac, Cahuzac, et al., 1990 | gas phase |
By formula: (K+ • 6K) + K = (K+ • 7K)
Quantity | Value | Units | Method | Reference | Comment |
---|---|---|---|---|---|
ΔrH° | 13.4 | kcal/mol | PDiss | Brechignac, Cahuzac, et al., 1990 | gas phase |
By formula: (K+ • 7K) + K = (K+ • 8K)
Quantity | Value | Units | Method | Reference | Comment |
---|---|---|---|---|---|
ΔrH° | 20.8 | kcal/mol | PDiss | Brechignac, Cahuzac, et al., 1990 | gas phase |
By formula: (K+ • 8K) + K = (K+ • 9K)
Quantity | Value | Units | Method | Reference | Comment |
---|---|---|---|---|---|
ΔrH° | 11.5 | kcal/mol | PDiss | Brechignac, Cahuzac, et al., 1990 | gas phase |

References

Cox, Wagman, et al., 1984
Cox, J.D.; Wagman, D.D.; Medvedev, V.A.,
CODATA Key Values for Thermodynamics, Hemisphere Publishing Corp., New York, 1984, 1. [all data]
Chase, 1998
Chase, M.W., Jr.,
NIST-JANAF Themochemical Tables, Fourth Edition,
J. Phys. Chem. Ref. Data, Monograph 9, 1998, 1-1951. [all data]
Honig and Kramer, 1969
Honig, R.E.; Kramer, D.A.,
Vapor pressure data for the solid and liquid elements,
RCA Rev., 1969, 1969, 285. [all data]
Fiock and Rodebush, 1926
Fiock, E.F.; Rodebush, W.H.,
The Vapor Pressures and Thermal Properties of Potassium and Some Alkali Halides,
J. Am. Chem. Soc., 1926, 48, 10, 2522-2528, https://doi.org/10.1021/ja01421a006
. [all data]
Brechignac, Cahuzac, et al., 1990
Brechignac, C.; Cahuzac, P.; Carlier, F.; De Frutos, M.; Leyniger, J.,
Cohesive Energies of (K)n+ 5<n<200 from Photoevaporation Experiments,
J. Chem. Phys., 1990, 93, 10, 7449, https://doi.org/10.1063/1.459418
. [all data]