nickel
- Formula: Ni
- Molecular weight: 58.6934
- IUPAC Standard InChIKey: PXHVJJICTQNCMI-UHFFFAOYSA-N
- CAS Registry Number: 7440-02-0
- Chemical structure:
- NIST Atomic Spectra Database - Lines Holdings (on physics web site)
- NIST Atomic Spectra Database - Levels Holdings (on physics web site)
- NIST Atomic Spectra Database - Ground states and ionization energies (on physics web site)
- Gas Phase Kinetics Database
- X-ray Photoelectron Spectroscopy Database, version 5.0

Gas phase thermochemistry data

Quantity | Value | Units | Method | Reference | Comment |
---|---|---|---|---|---|
ΔfH°gas | 430.12 | kJ/mol | Review | Chase, 1998 | Data last reviewed in December, 1976 |
Quantity | Value | Units | Method | Reference | Comment |
S°gas,1 bar | 182.19 | J/mol*K | Review | Chase, 1998 | Data last reviewed in December, 1976 |
Gas Phase Heat Capacity (Shomate Equation)
Cp° = A + B*t + C*t2 + D*t3 +
E/t2
H° − H°298.15= A*t + B*t2/2 +
C*t3/3 + D*t4/4 − E/t + F − H
S° = A*ln(t) + B*t + C*t2/2 + D*t3/3 −
E/(2*t2) + G
Cp = heat capacity (J/mol*K)
H° = standard enthalpy (kJ/mol)
S° = standard entropy (J/mol*K)
t = temperature (K) / 1000.
View plot Requires a JavaScript / HTML 5 canvas capable browser.
Temperature (K) | 3156.584 to 6000. |
---|---|
A | 27.13127 |
B | -2.587562 |
C | 0.295110 |
D | 0.015200 |
E | 0.041830 |
F | 421.4585 |
G | 214.1643 |
H | 430.1152 |
Reference | Chase, 1998 |
Comment | Data last reviewed in December, 1976 |

Reaction thermochemistry data

Data compiled as indicated in comments:
MS - José A. Martinho Simões
M - Michael M. Meot-Ner (Mautner) and Sharon G. Lias
B - John E. Bartmess
Individual Reactions
By formula: C4NiO4 (g) = 4CO (g) + Ni (cr)
Quantity | Value | Units | Method | Reference | Comment |
---|---|---|---|---|---|
ΔrH° | 160.4 ± 2.5 | kJ/mol | EqG | Monteil, Raffin, et al., 1988 | The reaction enthalpy is the average of several 2nd and 3rd law results Monteil, Raffin, et al., 1988; MS |
CNiO (g) = (g) +
(g)
By formula: CNiO (g) = CO (g) + Ni (g)
Quantity | Value | Units | Method | Reference | Comment |
---|---|---|---|---|---|
ΔrH° | 170. ± 24. | kJ/mol | FA-SIFT | Sunderlin, Wang, et al., 1992 | MS |
ΔrH° | 108. | kJ/mol | N/A | McQuaid, Morris, et al., 1988 | Method: Chemiluminescence spectroscopy.; MS |
ΔrH° | 121. ± 63. | kJ/mol | N/A | Stevens, Feigerle, et al., 1982 | Please also see Compton and Stockdale, 1976. Method: LPS and collision with low energy electrons.; MS |
By formula: 4CO (g) + Ni (cr) = C4NiO4 (g)
Quantity | Value | Units | Method | Reference | Comment |
---|---|---|---|---|---|
ΔrH° | -152.7 ± 4.2 | kJ/mol | EqG | Sykes and Townshend, 1955 | Please also see Pedley and Rylance, 1977 and Cox and Pilcher, 1970. Temperatures: 398 and 409 K. The reaction enthalpy was obtained by the 3rd law method and refers to 298 K; MS |
(solution) = 2
(solution) +
(cr)
By formula: (Ni(C8H12)2) (solution) = 2C8H12 (solution) + Ni (cr)
Quantity | Value | Units | Method | Reference | Comment |
---|---|---|---|---|---|
ΔrH° | -12.6 ± 4.2 | kJ/mol | RSC | Tolman, Reutter D.W., et al., 1976 | solvent: Toluene; The toluene solution contained catalytic amounts of carbon tetrachloride.; MS |
By formula: (Ni+ • 10Ni) + Ni = (Ni+ • 11Ni)
Enthalpy of reaction
ΔrH° (kJ/mol) | T (K) | Method | Reference | Comment |
---|---|---|---|---|
335. | CID | Armentrout and Kickel, 1994 | gas phase; guided ion beam CID; M |
By formula: (Ni+ • 11Ni) + Ni = (Ni+ • 12Ni)
Enthalpy of reaction
ΔrH° (kJ/mol) | T (K) | Method | Reference | Comment |
---|---|---|---|---|
352. | CID | Armentrout and Kickel, 1994 | gas phase; guided ion beam CID; M |
By formula: (Ni+ • 12Ni) + Ni = (Ni+ • 13Ni)
Enthalpy of reaction
ΔrH° (kJ/mol) | T (K) | Method | Reference | Comment |
---|---|---|---|---|
299. | CID | Armentrout and Kickel, 1994 | gas phase; guided ion beam CID; M |
By formula: (Ni+ • 13Ni) + Ni = (Ni+ • 14Ni)
Enthalpy of reaction
ΔrH° (kJ/mol) | T (K) | Method | Reference | Comment |
---|---|---|---|---|
334. | CID | Armentrout and Kickel, 1994 | gas phase; guided ion beam CID; M |
By formula: (Ni+ • 14Ni) + Ni = (Ni+ • 15Ni)
Enthalpy of reaction
ΔrH° (kJ/mol) | T (K) | Method | Reference | Comment |
---|---|---|---|---|
338. | CID | Armentrout and Kickel, 1994 | gas phase; guided ion beam CID; M |
By formula: (Ni+ • 15Ni) + Ni = (Ni+ • 16Ni)
Enthalpy of reaction
ΔrH° (kJ/mol) | T (K) | Method | Reference | Comment |
---|---|---|---|---|
354. | CID | Armentrout and Kickel, 1994 | gas phase; guided ion beam CID; M |
By formula: (Ni+ • 16Ni) + Ni = (Ni+ • 17Ni)
Enthalpy of reaction
ΔrH° (kJ/mol) | T (K) | Method | Reference | Comment |
---|---|---|---|---|
341. | CID | Armentrout and Kickel, 1994 | gas phase; guided ion beam CID; M |
By formula: (Ni+ • 9Ni) + Ni = (Ni+ • 10Ni)
Enthalpy of reaction
ΔrH° (kJ/mol) | T (K) | Method | Reference | Comment |
---|---|---|---|---|
293. | CID | Armentrout and Kickel, 1994 | gas phase; guided ion beam CID; M |
By formula: (Ni+ • 2Ni) + Ni = (Ni+ • 3Ni)
Enthalpy of reaction
ΔrH° (kJ/mol) | T (K) | Method | Reference | Comment |
---|---|---|---|---|
199. | CID | Armentrout and Kickel, 1994 | gas phase; guided ion beam CID; M |
By formula: (Ni+ • 3Ni) + Ni = (Ni+ • 4Ni)
Enthalpy of reaction
ΔrH° (kJ/mol) | T (K) | Method | Reference | Comment |
---|---|---|---|---|
223. | CID | Armentrout and Kickel, 1994 | gas phase; guided ion beam CID; M |
By formula: (Ni+ • 4Ni) + Ni = (Ni+ • 5Ni)
Enthalpy of reaction
ΔrH° (kJ/mol) | T (K) | Method | Reference | Comment |
---|---|---|---|---|
275. | CID | Armentrout and Kickel, 1994 | gas phase; guided ion beam CID; M |
By formula: (Ni+ • 5Ni) + Ni = (Ni+ • 6Ni)
Enthalpy of reaction
ΔrH° (kJ/mol) | T (K) | Method | Reference | Comment |
---|---|---|---|---|
296. | CID | Armentrout and Kickel, 1994 | gas phase; guided ion beam CID; M |
By formula: (Ni+ • 6Ni) + Ni = (Ni+ • 7Ni)
Enthalpy of reaction
ΔrH° (kJ/mol) | T (K) | Method | Reference | Comment |
---|---|---|---|---|
265. | CID | Armentrout and Kickel, 1994 | gas phase; guided ion beam CID; M |
By formula: (Ni+ • 7Ni) + Ni = (Ni+ • 8Ni)
Enthalpy of reaction
ΔrH° (kJ/mol) | T (K) | Method | Reference | Comment |
---|---|---|---|---|
283. | CID | Armentrout and Kickel, 1994 | gas phase; guided ion beam CID; M |
By formula: (Ni+ • 8Ni) + Ni = (Ni+ • 9Ni)
Enthalpy of reaction
ΔrH° (kJ/mol) | T (K) | Method | Reference | Comment |
---|---|---|---|---|
283. | CID | Armentrout and Kickel, 1994 | gas phase; guided ion beam CID; M |
By formula: (Ni+ • Ni) + Ni = (Ni+ • 2Ni)
Enthalpy of reaction
ΔrH° (kJ/mol) | T (K) | Method | Reference | Comment |
---|---|---|---|---|
235. | CID | Armentrout and Kickel, 1994 | gas phase; guided ion beam CID; M |
By formula: Ni+ + Ni = (Ni+ • Ni)
Enthalpy of reaction
ΔrH° (kJ/mol) | T (K) | Method | Reference | Comment |
---|---|---|---|---|
204. | CID | Armentrout and Kickel, 1994 | gas phase; guided ion beam CID; M |
(CAS Reg. No. 64899-92-9 • 4294967295) +
= CAS Reg. No. 64899-92-9
By formula: (CAS Reg. No. 64899-92-9 • 4294967295Ni) + Ni = CAS Reg. No. 64899-92-9
Quantity | Value | Units | Method | Reference | Comment |
---|---|---|---|---|---|
ΔrH° | 191.6 ± 3.1 | kJ/mol | N/A | Miller, Feigerle, et al., 1987 | gas phase; B |
(CAS Reg. No. 71736-54-4 • 4294967295) +
= CAS Reg. No. 71736-54-4
By formula: (CAS Reg. No. 71736-54-4 • 4294967295Ni) + Ni = CAS Reg. No. 71736-54-4
Quantity | Value | Units | Method | Reference | Comment |
---|---|---|---|---|---|
ΔrH° | 210. ± 21. | kJ/mol | N/A | Ho, Polak, et al., 1993 | gas phase; B |
By formula: F12NiP4 (l) = Ni (cr) + 4F3P (g)
Quantity | Value | Units | Method | Reference | Comment |
---|---|---|---|---|---|
ΔrH° | 194.2 ± 8.4 | kJ/mol | HAL-HFC | Brown and Connor, 1974 | MS |

Condensed phase thermochemistry data

Quantity | Value | Units | Method | Reference | Comment |
---|---|---|---|---|---|
ΔfH°liquid | 17.48 | kJ/mol | Review | Chase, 1998 | Data last reviewed in December, 1976 |
Quantity | Value | Units | Method | Reference | Comment |
S°liquid,1 bar | 41.49 | J/mol*K | Review | Chase, 1998 | Data last reviewed in December, 1976 |
Quantity | Value | Units | Method | Reference | Comment |
S°solid | 29.87 | J/mol*K | Review | Chase, 1998 | Data last reviewed in December, 1976 |
Liquid Phase Heat Capacity (Shomate Equation)
Cp° = A + B*t + C*t2 + D*t3 +
E/t2
H° − H°298.15= A*t + B*t2/2 +
C*t3/3 + D*t4/4 − E/t + F − H
S° = A*ln(t) + B*t + C*t2/2 + D*t3/3 −
E/(2*t2) + G
Cp = heat capacity (J/mol*K)
H° = standard enthalpy (kJ/mol)
S° = standard entropy (J/mol*K)
t = temperature (K) / 1000.
View plot Requires a JavaScript / HTML 5 canvas capable browser.
Temperature (K) | 1728. to 3156.584 |
---|---|
A | 38.91103 |
B | 0.000000 |
C | 0.000000 |
D | 0.000000 |
E | 0.000000 |
F | -2.722630 |
G | 74.47143 |
H | 17.47904 |
Reference | Chase, 1998 |
Comment | Data last reviewed in December, 1976 |
Solid Phase Heat Capacity (Shomate Equation)
Cp° = A + B*t + C*t2 + D*t3 +
E/t2
H° − H°298.15= A*t + B*t2/2 +
C*t3/3 + D*t4/4 − E/t + F − H
S° = A*ln(t) + B*t + C*t2/2 + D*t3/3 −
E/(2*t2) + G
Cp = heat capacity (J/mol*K)
H° = standard enthalpy (kJ/mol)
S° = standard entropy (J/mol*K)
t = temperature (K) / 1000.
View plot Requires a JavaScript / HTML 5 canvas capable browser.
Temperature (K) | 298. to 600. | 600. to 700. | 700. to 1728. |
---|---|---|---|
A | 13.69160 | 1248.045 | 16.49839 |
B | 82.49509 | -1257.510 | 18.74913 |
C | -174.9548 | 0.000000 | -6.639841 |
D | 161.6011 | 0.000000 | 1.717278 |
E | -0.092417 | -165.1266 | 1.872051 |
F | -6.833644 | -788.8263 | -0.467675 |
G | 27.66900 | 1212.891 | 51.67575 |
H | 0.000000 | 0.000000 | 0.000000 |
Reference | Chase, 1998 | Chase, 1998 | Chase, 1998 |
Comment | Data last reviewed in December, 1976 | Data last reviewed in December, 1976 | Data last reviewed in December, 1976 |

Gas phase ion energetics data

Data evaluated as indicated in comments:
HL - Edward P. Hunter and Sharon G. Lias
L - Sharon G. Lias
Data compiled as indicated in comments:
LL - Sharon G. Lias and Joel F. Liebman
LBLHLM - Sharon G. Lias, John E. Bartmess, Joel F. Liebman, John L. Holmes, Rhoda D. Levin, and W. Gary Mallard
LLK - Sharon G. Lias, Rhoda D. Levin, and Sherif A. Kafafi
RDSH - Henry M. Rosenstock, Keith Draxl, Bruce W. Steiner, and John T. Herron
B - John E. Bartmess
Quantity | Value | Units | Method | Reference | Comment |
---|---|---|---|---|---|
IE (evaluated) | 7.6398 | eV | N/A | N/A | L |
Quantity | Value | Units | Method | Reference | Comment |
Proton affinity (review) | 737. | kJ/mol | N/A | Hunter and Lias, 1998 | HL |
Quantity | Value | Units | Method | Reference | Comment |
Gas basicity | 714.1 | kJ/mol | N/A | Hunter and Lias, 1998 | HL |
Electron affinity determinations
EA (eV) | Method | Reference | Comment |
---|---|---|---|
1.160 ± 0.050 | LPES | Liu, Zhai, et al., 2002 | B |
1.15717 ± 0.00013 | N/A | Scheer, Brodie, et al., 1998 | B |
1.157 ± 0.010 | LPES | Corderman, Engelking, et al., 1979 | B |
Ionization energy determinations
IE (eV) | Method | Reference | Comment |
---|---|---|---|
7.6398 | EVAL | Lide, 1992 | LL |
7.6398 | LS | Page and Gudeman, 1990 | LL |
7.638 | S | Kelly, 1987 | LBLHLM |
7.6374 ± 0.0012 | S | Sugar and Corliss, 1985 | LBLHLM |
7.61 | PE | Dyke, Gravenor, et al., 1982 | LBLHLM |
7.6 ± 0.2 | EI | Clements and Sale, 1976 | LLK |
7.635 | S | Moore, 1970 | RDSH |

Phase change data

Antoine Equation Parameters
log10(P) = A − (B / (T + C))
P = vapor pressure (atm)
T = temperature (K)
View plot Requires a JavaScript / HTML 5 canvas capable browser.
Temperature (K) | A | B | C | Reference | Comment |
---|---|---|---|---|---|
2083. to 3005. | 5.97612 | 16808.435 | -188.717 | Stull, 1947 | Coefficents calculated by NIST from author's data. |

Ion clustering data

Data compiled by: Michael M. Meot-Ner (Mautner) and Sharon G. Lias

Clustering reactions

Nickel ion (1+) + nickel = (Nickel ion (1+) • nickel)

By formula: Ni+ + Ni = (Ni+ • Ni)

Enthalpy of reaction

ΔrH° (kJ/mol) T (K) Method Reference Comment
204. CIDArmentrout and Kickel, 1994gas phase; guided ion beam CID

(Nickel ion (1+) • nickel) + nickel = (Nickel ion (1+) • 2nickel)

By formula: (Ni+ • Ni) + Ni = (Ni+ • 2Ni)

Enthalpy of reaction

ΔrH° (kJ/mol) T (K) Method Reference Comment
235. CIDArmentrout and Kickel, 1994gas phase; guided ion beam CID

(Nickel ion (1+) • 2nickel) + nickel = (Nickel ion (1+) • 3nickel)

By formula: (Ni+ • 2Ni) + Ni = (Ni+ • 3Ni)

Enthalpy of reaction

ΔrH° (kJ/mol) T (K) Method Reference Comment
199. CIDArmentrout and Kickel, 1994gas phase; guided ion beam CID

(Nickel ion (1+) • 3nickel) + nickel = (Nickel ion (1+) • 4nickel)

By formula: (Ni+ • 3Ni) + Ni = (Ni+ • 4Ni)

Enthalpy of reaction

ΔrH° (kJ/mol) T (K) Method Reference Comment
223. CIDArmentrout and Kickel, 1994gas phase; guided ion beam CID

(Nickel ion (1+) • 4nickel) + nickel = (Nickel ion (1+) • 5nickel)

By formula: (Ni+ • 4Ni) + Ni = (Ni+ • 5Ni)

Enthalpy of reaction

ΔrH° (kJ/mol) T (K) Method Reference Comment
275. CIDArmentrout and Kickel, 1994gas phase; guided ion beam CID

(Nickel ion (1+) • 5nickel) + nickel = (Nickel ion (1+) • 6nickel)

By formula: (Ni+ • 5Ni) + Ni = (Ni+ • 6Ni)

Enthalpy of reaction

ΔrH° (kJ/mol) T (K) Method Reference Comment
296. CIDArmentrout and Kickel, 1994gas phase; guided ion beam CID

(Nickel ion (1+) • 6nickel) + nickel = (Nickel ion (1+) • 7nickel)

By formula: (Ni+ • 6Ni) + Ni = (Ni+ • 7Ni)

Enthalpy of reaction

ΔrH° (kJ/mol) T (K) Method Reference Comment
265. CIDArmentrout and Kickel, 1994gas phase; guided ion beam CID

(Nickel ion (1+) • 7nickel) + nickel = (Nickel ion (1+) • 8nickel)

By formula: (Ni+ • 7Ni) + Ni = (Ni+ • 8Ni)

Enthalpy of reaction

ΔrH° (kJ/mol) T (K) Method Reference Comment
283. CIDArmentrout and Kickel, 1994gas phase; guided ion beam CID

(Nickel ion (1+) • 8nickel) + nickel = (Nickel ion (1+) • 9nickel)

By formula: (Ni+ • 8Ni) + Ni = (Ni+ • 9Ni)

Enthalpy of reaction

ΔrH° (kJ/mol) T (K) Method Reference Comment
283. CIDArmentrout and Kickel, 1994gas phase; guided ion beam CID

(Nickel ion (1+) • 9nickel) + nickel = (Nickel ion (1+) • 10nickel)

By formula: (Ni+ • 9Ni) + Ni = (Ni+ • 10Ni)

Enthalpy of reaction

ΔrH° (kJ/mol) T (K) Method Reference Comment
293. CIDArmentrout and Kickel, 1994gas phase; guided ion beam CID

(Nickel ion (1+) • 10nickel) + nickel = (Nickel ion (1+) • 11nickel)

By formula: (Ni+ • 10Ni) + Ni = (Ni+ • 11Ni)

Enthalpy of reaction

ΔrH° (kJ/mol) T (K) Method Reference Comment
335. CIDArmentrout and Kickel, 1994gas phase; guided ion beam CID

(Nickel ion (1+) • 11nickel) + nickel = (Nickel ion (1+) • 12nickel)

By formula: (Ni+ • 11Ni) + Ni = (Ni+ • 12Ni)

Enthalpy of reaction

ΔrH° (kJ/mol) T (K) Method Reference Comment
352. CIDArmentrout and Kickel, 1994gas phase; guided ion beam CID

(Nickel ion (1+) • 12nickel) + nickel = (Nickel ion (1+) • 13nickel)

By formula: (Ni+ • 12Ni) + Ni = (Ni+ • 13Ni)

Enthalpy of reaction

ΔrH° (kJ/mol) T (K) Method Reference Comment
299. CIDArmentrout and Kickel, 1994gas phase; guided ion beam CID

(Nickel ion (1+) • 13nickel) + nickel = (Nickel ion (1+) • 14nickel)

By formula: (Ni+ • 13Ni) + Ni = (Ni+ • 14Ni)

Enthalpy of reaction

ΔrH° (kJ/mol) T (K) Method Reference Comment
334. CIDArmentrout and Kickel, 1994gas phase; guided ion beam CID

(Nickel ion (1+) • 14nickel) + nickel = (Nickel ion (1+) • 15nickel)

By formula: (Ni+ • 14Ni) + Ni = (Ni+ • 15Ni)

Enthalpy of reaction

ΔrH° (kJ/mol) T (K) Method Reference Comment
338. CIDArmentrout and Kickel, 1994gas phase; guided ion beam CID

(Nickel ion (1+) • 15nickel) + nickel = (Nickel ion (1+) • 16nickel)

By formula: (Ni+ • 15Ni) + Ni = (Ni+ • 16Ni)

Enthalpy of reaction

ΔrH° (kJ/mol) T (K) Method Reference Comment
354. CIDArmentrout and Kickel, 1994gas phase; guided ion beam CID

(Nickel ion (1+) • 16nickel) + nickel = (Nickel ion (1+) • 17nickel)

By formula: (Ni+ • 16Ni) + Ni = (Ni+ • 17Ni)

Enthalpy of reaction

ΔrH° (kJ/mol) T (K) Method Reference Comment
341. CIDArmentrout and Kickel, 1994gas phase; guided ion beam CID

References

Chase, 1998
Chase, M.W., Jr.,
NIST-JANAF Themochemical Tables, Fourth Edition,
J. Phys. Chem. Ref. Data, Monograph 9, 1998, 1-1951. [all data]
Monteil, Raffin, et al., 1988
Monteil, Y.; Raffin, P.; Bouix, J.,
Thermochim. Acta, 1988, 125, 327. [all data]
Sunderlin, Wang, et al., 1992
Sunderlin, L.S.; Wang, D.; Squires, R.R.,
Metal Carbonyl Bond Strengths in Fe(CO)n- and Ni(CO)n-,
J. Am. Chem. Soc., 1992, 114, 8, 2788, https://doi.org/10.1021/ja00034a004
. [all data]
McQuaid, Morris, et al., 1988
McQuaid, M.J.; Morris, K.; Gole, J.L.,
J. Am. Chem. Soc., 1988, 110, 5280. [all data]
Stevens, Feigerle, et al., 1982
Stevens, A.E.; Feigerle, C.S.; Lineberger, W.C.,
Laser Photoelectron Spectrometry of Ni(CO)n-, n=1-3,
J. Am. Chem. Soc., 1982, 104, 19, 5026, https://doi.org/10.1021/ja00383a004
. [all data]
Compton and Stockdale, 1976
Compton, R.N.; Stockdale, J.A.D.,
Formation of gas phase negative ions in Fe(CO)5 and Ni(CO)4,
Int. J. Mass Spectrom. Ion Phys., 1976, 22, 47. [all data]
Sykes and Townshend, 1955
Sykes, K.W.; Townshend, S.C.,
J. Chem. Soc., 1955, 2528.. [all data]
Pedley and Rylance, 1977
Pedley, J.B.; Rylance, J.,
Computer Analysed Thermochemical Data: Organic and Organometallic Compounds, University of Sussex, Brigton, 1977. [all data]
Cox and Pilcher, 1970
Cox, J.D.; Pilcher, G.,
Thermochemistry of Organic and Organometallic Compounds
in Academic Press, New York, 1970. [all data]
Tolman, Reutter D.W., et al., 1976
Tolman, C.A.; Reutter D.W.; Seidel, W.C.,
J. Organometal. Chem., 1976, 117, C30. [all data]
Armentrout and Kickel, 1994
Armentrout, P.B.; Kickel, B.L.,
Gas Phase Thermochemistry of Transition Metal Ligand Systems: Reassessment of Values and Periodic Trends, in Organometallic Ion Chemistry, B. S. Freiser, ed, 1994. [all data]
Miller, Feigerle, et al., 1987
Miller, A.E.S.; Feigerle, C.S.; Lineberger, W.C.,
Laser photoelectron spectroscopy of CrH-, CoH-, and NiH-: Periodic trends in the electronic structure of the transition-metal hydrides,
J. Chem. Phys., 1987, 86, 1549. [all data]
Ho, Polak, et al., 1993
Ho, J.; Polak, M.L.; Ervin, K.M.; Lineberger, W.C.,
Photoelectron Spectroscopy of Nickel Group Dimers - Ni2(-), Pd2(-), and Pt2(-),
J. Chem. Phys., 1993, 99, 11, 8542, https://doi.org/10.1063/1.465577
. [all data]
Brown and Connor, 1974
Brown, D.L.S.; Connor, J.A.,
Skinner, H. A. J. Chem. Soc., Faraday Trans. I, 1974, 70, 1649. [all data]