neon
- Formula: Ne
- Molecular weight: 20.1797
- IUPAC Standard InChIKey: GKAOGPIIYCISHV-UHFFFAOYSA-N
- CAS Registry Number: 7440-01-9
- Chemical structure:
- NIST Atomic Spectra Database - Lines Holdings (on physics web site)
- NIST Atomic Spectra Database - Levels Holdings (on physics web site)
- NIST Atomic Spectra Database - Ground states and ionization energies (on physics web site)
- Gas Phase Kinetics Database
- X-ray Photoelectron Spectroscopy Database, version 5.0
- X-ray Photoelectron Spectroscopy Database, version 5.0
- X-ray Photoelectron Spectroscopy Database, version 5.0
- X-ray Photoelectron Spectroscopy Database, version 5.0

Gas phase thermochemistry data

Quantity | Value | Units | Method | Reference | Comment |
---|---|---|---|---|---|
S°gas,1 bar | 146.328 ± 0.003 | J/mol*K | Review | Cox, Wagman, et al., 1984 | CODATA Review value |
S°gas,1 bar | 146.33 | J/mol*K | Review | Chase, 1998 | Data last reviewed in March, 1982 |
Gas Phase Heat Capacity (Shomate Equation)
Cp° = A + B*t + C*t2 + D*t3 +
E/t2
H° − H°298.15= A*t + B*t2/2 +
C*t3/3 + D*t4/4 − E/t + F − H
S° = A*ln(t) + B*t + C*t2/2 + D*t3/3 −
E/(2*t2) + G
Cp = heat capacity (J/mol*K)
H° = standard enthalpy (kJ/mol)
S° = standard entropy (J/mol*K)
t = temperature (K) / 1000.
View plot Requires a JavaScript / HTML 5 canvas capable browser.
Temperature (K) | 298. to 6000. |
---|---|
A | 20.78603 |
B | 4.850638×10-10 |
C | -1.582916×10-10 |
D | 1.525102×10-11 |
E | 3.196347×10-11 |
F | -6.197341 |
G | 171.4821 |
H | 0.000000 |
Reference | Chase, 1998 |
Comment | Data last reviewed in March, 1982 |

Reaction thermochemistry data

Data compiled by: Michael M. Meot-Ner (Mautner) and Sharon G. Lias
Individual Reactions
By formula: (Co+ • Ne) + Ne = (Co+ • 2Ne)
Quantity | Value | Units | Method | Reference | Comment |
---|---|---|---|---|---|
ΔrH° | 8.2 ± 0.4 | kJ/mol | SIDT | Kemper, Hsu, et al., 1991 | gas phase; ΔrH90 K) = 8.16 kJ/mol, ΔrS(100 K) = 52.3 J/mol*K |
Quantity | Value | Units | Method | Reference | Comment |
ΔrS° | 48.5 | J/mol*K | SIDT | Kemper, Hsu, et al., 1991 | gas phase; ΔrH90 K) = 8.16 kJ/mol, ΔrS(100 K) = 52.3 J/mol*K |
By formula: (Cr+ • Ne) + Ne = (Cr+ • 2Ne)
Quantity | Value | Units | Method | Reference | Comment |
---|---|---|---|---|---|
ΔrH° | 3.6 ± 0.4 | kJ/mol | SIDT | Kemper, Hsu, et al., 1991 | gas phase; ΔrH(0 K) = 3.8 kJ/mol, ΔrS(100 K) = 28. J/mol*K |
Quantity | Value | Units | Method | Reference | Comment |
ΔrS° | 24. | J/mol*K | SIDT | Kemper, Hsu, et al., 1991 | gas phase; ΔrH(0 K) = 3.8 kJ/mol, ΔrS(100 K) = 28. J/mol*K |
By formula: Ni+ + Ne = (Ni+ • Ne)
Quantity | Value | Units | Method | Reference | Comment |
---|---|---|---|---|---|
ΔrH° | 11.5 ± 0.4 | kJ/mol | SIDT | Kemper, Hsu, et al., 1991 | gas phase; ΔrH(0 K) = 9.92 kJ/mol, ΔrS(100 K) = 59.4 J/mol*K |
Enthalpy of reaction
ΔrH° (kJ/mol) | T (K) | Method | Reference | Comment |
---|---|---|---|---|
3.1 (+0.8,-0.) | SIDT | Kemper, Hsu, et al., 1991 | gas phase; ΔrS(300K), ΔrS(100) K = 49.8 J/mol*K, (Ni+)* |
By formula: Cr+ + Ne = (Cr+ • Ne)
Quantity | Value | Units | Method | Reference | Comment |
---|---|---|---|---|---|
ΔrH° | 6.8 ± 0.4 | kJ/mol | SIDT | Kemper, Hsu, et al., 1991 | gas phase; ΔrH(0 K) = 5.77 kJ/mol, ΔrS(100 K) = 55.6 J/mol*K |
Quantity | Value | Units | Method | Reference | Comment |
ΔrS° | 61.1 | J/mol*K | SIDT | Kemper, Hsu, et al., 1991 | gas phase; ΔrH(0 K) = 5.77 kJ/mol, ΔrS(100 K) = 55.6 J/mol*K |
By formula: Co+ + Ne = (Co+ • Ne)
Quantity | Value | Units | Method | Reference | Comment |
---|---|---|---|---|---|
ΔrH° | 10.5 ± 0.4 | kJ/mol | SIDT | Kemper, Hsu, et al., 1991 | gas phase; ΔrH(0 K) = 9.12 kJ/mol, ΔrS(100 K) = 58.6 J/mol*K |
Quantity | Value | Units | Method | Reference | Comment |
ΔrS° | 64.4 | J/mol*K | SIDT | Kemper, Hsu, et al., 1991 | gas phase; ΔrH(0 K) = 9.12 kJ/mol, ΔrS(100 K) = 58.6 J/mol*K |
By formula: (Ni+ • Ne) + Ne = (Ni+ • 2Ne)
Quantity | Value | Units | Method | Reference | Comment |
---|---|---|---|---|---|
ΔrH° | 9.6 ± 0.8 | kJ/mol | SIDT | Kemper, Hsu, et al., 1991 | gas phase; ΔrH(0 K) = 2.16, ΔrS(100 K) = 57.3 J/mol*K |
Quantity | Value | Units | Method | Reference | Comment |
ΔrS° | 53.6 | J/mol*K | SIDT | Kemper, Hsu, et al., 1991 | gas phase; ΔrH(0 K) = 2.16, ΔrS(100 K) = 57.3 J/mol*K |
By formula: K+ + Ne = (K+ • Ne)
Quantity | Value | Units | Method | Reference | Comment |
---|---|---|---|---|---|
ΔrH° | 4.56 | kJ/mol | SCATTERING | Gislason, 1984 | gas phase |
ΔrH° | 3.8 | kJ/mol | IMob | Viehland, 1984 | gas phase |
ΔrH° | 4.0 | kJ/mol | IMob | Takebe, 1983 | gas phase |
ΔrH° | 4.1 | kJ/mol | IMob | Robson and Kumar, 1973 | gas phase |
By formula: Li+ + Ne = (Li+ • Ne)
Quantity | Value | Units | Method | Reference | Comment |
---|---|---|---|---|---|
ΔrH° | 11.0 | kJ/mol | SCATTERING | Gislason, 1984 | gas phase |
ΔrH° | 11.9 | kJ/mol | IMob | Viehland, 1984 | gas phase |
ΔrH° | 14.0 | kJ/mol | IMob | Takebe, 1983 | gas phase |
By formula: Na+ + Ne = (Na+ • Ne)
Quantity | Value | Units | Method | Reference | Comment |
---|---|---|---|---|---|
ΔrH° | 7.36 | kJ/mol | SCATTERING | Gislason, 1984 | gas phase |
ΔrH° | 6.36 | kJ/mol | IMob | Viehland, 1984 | gas phase |
ΔrH° | 6.07 | kJ/mol | IMob | Takebe, 1983 | gas phase |
By formula: Cs+ + Ne = (Cs+ • Ne)
Quantity | Value | Units | Method | Reference | Comment |
---|---|---|---|---|---|
ΔrH° | 2.3 | kJ/mol | SCATTERING | Gislason, 1984 | gas phase |
ΔrH° | 2.7 | kJ/mol | IMob | Takebe, 1983 | gas phase; values from this reference are too high |
By formula: (Ne+ • 2Ne) + Ne = (Ne+ • 3Ne)
Quantity | Value | Units | Method | Reference | Comment |
---|---|---|---|---|---|
ΔrH° | 10.3 ± 0.63 | kJ/mol | PHPMS | Hiraoka and Mori, 1990 | gas phase |
Quantity | Value | Units | Method | Reference | Comment |
ΔrS° | 78.2 | J/mol*K | PHPMS | Hiraoka and Mori, 1990 | gas phase |
By formula: (Ne+ • 3Ne) + Ne = (Ne+ • 4Ne)
Quantity | Value | Units | Method | Reference | Comment |
---|---|---|---|---|---|
ΔrH° | 3.3 ± 0.63 | kJ/mol | PHPMS | Hiraoka and Mori, 1990 | gas phase |
Quantity | Value | Units | Method | Reference | Comment |
ΔrS° | 53.1 | J/mol*K | PHPMS | Hiraoka and Mori, 1990 | gas phase |
By formula: (Ne+ • 4Ne) + Ne = (Ne+ • 5Ne)
Quantity | Value | Units | Method | Reference | Comment |
---|---|---|---|---|---|
ΔrH° | 3.2 ± 0.63 | kJ/mol | PHPMS | Hiraoka and Mori, 1990 | gas phase |
Quantity | Value | Units | Method | Reference | Comment |
ΔrS° | 56.1 | J/mol*K | PHPMS | Hiraoka and Mori, 1990 | gas phase |
By formula: (Ne+ • 5Ne) + Ne = (Ne+ • 6Ne)
Quantity | Value | Units | Method | Reference | Comment |
---|---|---|---|---|---|
ΔrH° | 3.2 ± 0.63 | kJ/mol | PHPMS | Hiraoka and Mori, 1990 | gas phase |
Quantity | Value | Units | Method | Reference | Comment |
ΔrS° | 57.7 | J/mol*K | PHPMS | Hiraoka and Mori, 1990 | gas phase |
By formula: (Ne+ • 6Ne) + Ne = (Ne+ • 7Ne)
Quantity | Value | Units | Method | Reference | Comment |
---|---|---|---|---|---|
ΔrH° | 3.0 ± 0.63 | kJ/mol | PHPMS | Hiraoka and Mori, 1990 | gas phase |
Quantity | Value | Units | Method | Reference | Comment |
ΔrS° | 59.4 | J/mol*K | PHPMS | Hiraoka and Mori, 1990 | gas phase |
By formula: (Ne+ • 7Ne) + Ne = (Ne+ • 8Ne)
Quantity | Value | Units | Method | Reference | Comment |
---|---|---|---|---|---|
ΔrH° | 2.8 ± 0.63 | kJ/mol | PHPMS | Hiraoka and Mori, 1990 | gas phase |
Quantity | Value | Units | Method | Reference | Comment |
ΔrS° | 62.3 | J/mol*K | PHPMS | Hiraoka and Mori, 1990 | gas phase |
By formula: (Ne+ • 8Ne) + Ne = (Ne+ • 9Ne)
Quantity | Value | Units | Method | Reference | Comment |
---|---|---|---|---|---|
ΔrH° | 2.6 ± 0.63 | kJ/mol | PHPMS | Hiraoka and Mori, 1990 | gas phase |
Quantity | Value | Units | Method | Reference | Comment |
ΔrS° | 64.0 | J/mol*K | PHPMS | Hiraoka and Mori, 1990 | gas phase |
By formula: Ne+ + Ne = (Ne+ • Ne)
Quantity | Value | Units | Method | Reference | Comment |
---|---|---|---|---|---|
ΔrH° | 131. | kJ/mol | PI | Dehmer and Pratt, 1982 | gas phase |
ΔrH° | 126. | kJ/mol | SCATTERING | Mittman and Weise, 1974 | gas phase |
By formula: Rb+ + Ne = (Rb+ • Ne)
Quantity | Value | Units | Method | Reference | Comment |
---|---|---|---|---|---|
ΔrH° | 3.2 | kJ/mol | IMob | Viehland, 1984 | gas phase |
ΔrH° | 3.3 | kJ/mol | IMob | Takebe, 1983 | gas phase |
By formula: Kr+ + Ne = (Kr+ • Ne)
Quantity | Value | Units | Method | Reference | Comment |
---|---|---|---|---|---|
ΔrH° | 5.31 | kJ/mol | PI | Dehmer and Pratt, 1982 | gas phase |
By formula: Xe+ + Ne = (Xe+ • Ne)
Quantity | Value | Units | Method | Reference | Comment |
---|---|---|---|---|---|
ΔrH° | 4.0 | kJ/mol | PI | Dehmer and Pratt, 1982 | gas phase |
By formula: Ar+ + Ne = (Ar+ • Ne)
Quantity | Value | Units | Method | Reference | Comment |
---|---|---|---|---|---|
ΔrH° | 7.5 | kJ/mol | PI | Dehmer and Pratt, 1982 | gas phase |

Henry's Law data

Data compiled by: Rolf Sander
Henry's Law constant (water solution)
kH(T) = k°H exp(d(ln(kH))/d(1/T) ((1/T) - 1/(298.15 K)))
k°H = Henry's law constant for solubility in water at 298.15 K (mol/(kg*bar))
d(ln(kH))/d(1/T) = Temperature dependence constant (K)
k°H (mol/(kg*bar)) | d(ln(kH))/d(1/T) (K) | Method | Reference | Comment |
---|---|---|---|---|
0.00045 | 450. | L | N/A | |
0.00045 | 530. | M | N/A | Interpolation of the original data at T < 300. K. According to missing citation the solubility increases at higher temperatures. |

Phase change data

Data compiled as indicated in comments:
TRC - Thermodynamics Research Center, NIST Boulder Laboratories, Chris Muzny director
Quantity | Value | Units | Method | Reference | Comment |
---|---|---|---|---|---|
Ttriple | 24.56 | K | N/A | Ancsin, 1978 | Uncertainty assigned by TRC = 0.001 K; TRC |
Ttriple | 24.56 | K | N/A | Henning and Otto, 1936 | Uncertainty assigned by TRC = 0.05 K; temperature measured with He gas thermometer; TRC |
Quantity | Value | Units | Method | Reference | Comment |
Ptriple | 0.4280 | atm | N/A | Ancsin, 1978 | Uncertainty assigned by TRC = 0.000015 atm; TRC |
Ptriple | 0.427 | atm | N/A | Henning and Otto, 1936 | Uncertainty assigned by TRC = 0.0027 atm; TRC |
Antoine Equation Parameters
log10(P) = A − (B / (T + C))
P = vapor pressure (atm)
T = temperature (K)
View plot Requires a JavaScript / HTML 5 canvas capable browser.
Temperature (K) | A | B | C | Reference | Comment |
---|---|---|---|---|---|
15.9 to 27. | 3.75070 | 95.599 | -1.503 | Stull, 1947 | Coefficents calculated by NIST from author's data. |

Gas phase ion energetics data

Data evaluated as indicated in comments:
HL - Edward P. Hunter and Sharon G. Lias
L - Sharon G. Lias
Data compiled as indicated in comments:
LL - Sharon G. Lias and Joel F. Liebman
LBLHLM - Sharon G. Lias, John E. Bartmess, Joel F. Liebman, John L. Holmes, Rhoda D. Levin, and W. Gary Mallard
LLK - Sharon G. Lias, Rhoda D. Levin, and Sherif A. Kafafi
RDSH - Henry M. Rosenstock, Keith Draxl, Bruce W. Steiner, and John T. Herron
Quantity | Value | Units | Method | Reference | Comment |
---|---|---|---|---|---|
IE (evaluated) | 21.56454 ± 0.00001 | eV | N/A | N/A | L |
Quantity | Value | Units | Method | Reference | Comment |
Proton affinity (review) | 47.51 | kcal/mol | N/A | Hunter and Lias, 1998 | HL |
Quantity | Value | Units | Method | Reference | Comment |
Gas basicity | 41.68 | kcal/mol | N/A | Hunter and Lias, 1998 | HL |
Ionization energy determinations
IE (eV) | Method | Reference | Comment |
---|---|---|---|
21.56454 | EVAL | Lide, 1992 | LL |
21.50 | EI | Wetzel, Baiocchi, et al., 1987 | LBLHLM |
21.565 | S | Kelly, 1987 | LBLHLM |
22.0 | PE | Debies and Rabalais, 1975 | LLK |
21.59 | PE | Banna and Shirley, 1975 | LLK |
21.56471 ± 0.00001 | S | Kaufman and Minnhagen, 1972 | LLK |
21.56454 | S | Moore, 1970 | RDSH |

Ion clustering data

Data compiled by: Michael M. Meot-Ner (Mautner) and Sharon G. Lias
Clustering reactions
By formula: Ar+ + Ne = (Ar+ • Ne)
Quantity | Value | Units | Method | Reference | Comment |
---|---|---|---|---|---|
ΔrH° | 1.8 | kcal/mol | PI | Dehmer and Pratt, 1982 | gas phase |
By formula: Co+ + Ne = (Co+ • Ne)
Quantity | Value | Units | Method | Reference | Comment |
---|---|---|---|---|---|
ΔrH° | 2.5 ± 0.1 | kcal/mol | SIDT | Kemper, Hsu, et al., 1991 | gas phase; ΔrH(0 K) = 2.18 kcal/mol, ΔrS(100 K) = 14.0 cal/mol*K |
Quantity | Value | Units | Method | Reference | Comment |
ΔrS° | 15.4 | cal/mol*K | SIDT | Kemper, Hsu, et al., 1991 | gas phase; ΔrH(0 K) = 2.18 kcal/mol, ΔrS(100 K) = 14.0 cal/mol*K |
By formula: (Co+ • Ne) + Ne = (Co+ • 2Ne)
Quantity | Value | Units | Method | Reference | Comment |
---|---|---|---|---|---|
ΔrH° | 2.0 ± 0.1 | kcal/mol | SIDT | Kemper, Hsu, et al., 1991 | gas phase; ΔrH90 K) = 1.95 kcal/mol, ΔrS(100 K) = 12.5 cal/mol*K |
Quantity | Value | Units | Method | Reference | Comment |
ΔrS° | 11.6 | cal/mol*K | SIDT | Kemper, Hsu, et al., 1991 | gas phase; ΔrH90 K) = 1.95 kcal/mol, ΔrS(100 K) = 12.5 cal/mol*K |
By formula: Cr+ + Ne = (Cr+ • Ne)
Quantity | Value | Units | Method | Reference | Comment |
---|---|---|---|---|---|
ΔrH° | 1.6 ± 0.1 | kcal/mol | SIDT | Kemper, Hsu, et al., 1991 | gas phase; ΔrH(0 K) = 1.38 kcal/mol, ΔrS(100 K) = 13.3 cal/mol*K |
Quantity | Value | Units | Method | Reference | Comment |
ΔrS° | 14.6 | cal/mol*K | SIDT | Kemper, Hsu, et al., 1991 | gas phase; ΔrH(0 K) = 1.38 kcal/mol, ΔrS(100 K) = 13.3 cal/mol*K |
By formula: (Cr+ • Ne) + Ne = (Cr+ • 2Ne)
Quantity | Value | Units | Method | Reference | Comment |
---|---|---|---|---|---|
ΔrH° | 0.9 ± 0.1 | kcal/mol | SIDT | Kemper, Hsu, et al., 1991 | gas phase; ΔrH(0 K) = 0.90 kcal/mol, ΔrS(100 K) = 6.8 cal/mol*K |
Quantity | Value | Units | Method | Reference | Comment |
ΔrS° | 5.7 | cal/mol*K | SIDT | Kemper, Hsu, et al., 1991 | gas phase; ΔrH(0 K) = 0.90 kcal/mol, ΔrS(100 K) = 6.8 cal/mol*K |
By formula: Cs+ + Ne = (Cs+ • Ne)
Quantity | Value | Units | Method | Reference | Comment |
---|---|---|---|---|---|
ΔrH° | 0.56 | kcal/mol | SCATTERING | Gislason, 1984 | gas phase |
ΔrH° | 0.65 | kcal/mol | IMob | Takebe, 1983 | gas phase; values from this reference are too high |
By formula: K+ + Ne = (K+ • Ne)
Quantity | Value | Units | Method | Reference | Comment |
---|---|---|---|---|---|
ΔrH° | 1.09 | kcal/mol | SCATTERING | Gislason, 1984 | gas phase |
ΔrH° | 0.92 | kcal/mol | IMob | Viehland, 1984 | gas phase |
ΔrH° | 0.95 | kcal/mol | IMob | Takebe, 1983 | gas phase |
ΔrH° | 0.99 | kcal/mol | IMob | Robson and Kumar, 1973 | gas phase |
By formula: Kr+ + Ne = (Kr+ • Ne)
Quantity | Value | Units | Method | Reference | Comment |
---|---|---|---|---|---|
ΔrH° | 1.27 | kcal/mol | PI | Dehmer and Pratt, 1982 | gas phase |
By formula: Li+ + Ne = (Li+ • Ne)
Quantity | Value | Units | Method | Reference | Comment |
---|---|---|---|---|---|
ΔrH° | 2.63 | kcal/mol | SCATTERING | Gislason, 1984 | gas phase |
ΔrH° | 2.84 | kcal/mol | IMob | Viehland, 1984 | gas phase |
ΔrH° | 3.34 | kcal/mol | IMob | Takebe, 1983 | gas phase |
By formula: Na+ + Ne = (Na+ • Ne)
Quantity | Value | Units | Method | Reference | Comment |
---|---|---|---|---|---|
ΔrH° | 1.76 | kcal/mol | SCATTERING | Gislason, 1984 | gas phase |
ΔrH° | 1.52 | kcal/mol | IMob | Viehland, 1984 | gas phase |
ΔrH° | 1.45 | kcal/mol | IMob | Takebe, 1983 | gas phase |
By formula: Ne+ + Ne = (Ne+ • Ne)
Quantity | Value | Units | Method | Reference | Comment |
---|---|---|---|---|---|
ΔrH° | 31.4 | kcal/mol | PI | Dehmer and Pratt, 1982 | gas phase |
ΔrH° | 30.0 | kcal/mol | SCATTERING | Mittman and Weise, 1974 | gas phase |
By formula: (Ne+ • 2Ne) + Ne = (Ne+ • 3Ne)
Quantity | Value | Units | Method | Reference | Comment |
---|---|---|---|---|---|
ΔrH° | 2.47 ± 0.15 | kcal/mol | PHPMS | Hiraoka and Mori, 1990 | gas phase |
Quantity | Value | Units | Method | Reference | Comment |
ΔrS° | 18.7 | cal/mol*K | PHPMS | Hiraoka and Mori, 1990 | gas phase |
By formula: (Ne+ • 3Ne) + Ne = (Ne+ • 4Ne)
Quantity | Value | Units | Method | Reference | Comment |
---|---|---|---|---|---|
ΔrH° | 0.79 ± 0.15 | kcal/mol | PHPMS | Hiraoka and Mori, 1990 | gas phase |
Quantity | Value | Units | Method | Reference | Comment |
ΔrS° | 12.7 | cal/mol*K | PHPMS | Hiraoka and Mori, 1990 | gas phase |
By formula: (Ne+ • 4Ne) + Ne = (Ne+ • 5Ne)
Quantity | Value | Units | Method | Reference | Comment |
---|---|---|---|---|---|
ΔrH° | 0.77 ± 0.15 | kcal/mol | PHPMS | Hiraoka and Mori, 1990 | gas phase |
Quantity | Value | Units | Method | Reference | Comment |
ΔrS° | 13.4 | cal/mol*K | PHPMS | Hiraoka and Mori, 1990 | gas phase |
By formula: (Ne+ • 5Ne) + Ne = (Ne+ • 6Ne)
Quantity | Value | Units | Method | Reference | Comment |
---|---|---|---|---|---|
ΔrH° | 0.76 ± 0.15 | kcal/mol | PHPMS | Hiraoka and Mori, 1990 | gas phase |
Quantity | Value | Units | Method | Reference | Comment |
ΔrS° | 13.8 | cal/mol*K | PHPMS | Hiraoka and Mori, 1990 | gas phase |
By formula: (Ne+ • 6Ne) + Ne = (Ne+ • 7Ne)
Quantity | Value | Units | Method | Reference | Comment |
---|---|---|---|---|---|
ΔrH° | 0.72 ± 0.15 | kcal/mol | PHPMS | Hiraoka and Mori, 1990 | gas phase |
Quantity | Value | Units | Method | Reference | Comment |
ΔrS° | 14.2 | cal/mol*K | PHPMS | Hiraoka and Mori, 1990 | gas phase |
By formula: (Ne+ • 7Ne) + Ne = (Ne+ • 8Ne)
Quantity | Value | Units | Method | Reference | Comment |
---|---|---|---|---|---|
ΔrH° | 0.67 ± 0.15 | kcal/mol | PHPMS | Hiraoka and Mori, 1990 | gas phase |
Quantity | Value | Units | Method | Reference | Comment |
ΔrS° | 14.9 | cal/mol*K | PHPMS | Hiraoka and Mori, 1990 | gas phase |
By formula: (Ne+ • 8Ne) + Ne = (Ne+ • 9Ne)
Quantity | Value | Units | Method | Reference | Comment |
---|---|---|---|---|---|
ΔrH° | 0.62 ± 0.15 | kcal/mol | PHPMS | Hiraoka and Mori, 1990 | gas phase |
Quantity | Value | Units | Method | Reference | Comment |
ΔrS° | 15.3 | cal/mol*K | PHPMS | Hiraoka and Mori, 1990 | gas phase |
By formula: Ni+ + Ne = (Ni+ • Ne)
Quantity | Value | Units | Method | Reference | Comment |
---|---|---|---|---|---|
ΔrH° | 2.8 ± 0.1 | kcal/mol | SIDT | Kemper, Hsu, et al., 1991 | gas phase; ΔrH(0 K) = 2.37 kcal/mol, ΔrS(100 K) = 14.2 cal/mol*K |
Enthalpy of reaction
ΔrH° (kcal/mol) | T (K) | Method | Reference | Comment |
---|---|---|---|---|
0.7 (+0.2,-0.) | SIDT | Kemper, Hsu, et al., 1991 | gas phase; ΔrS(300K), ΔrS(100) K = 11.9 cal/mol*K, (Ni+)* |
By formula: (Ni+ • Ne) + Ne = (Ni+ • 2Ne)
Quantity | Value | Units | Method | Reference | Comment |
---|---|---|---|---|---|
ΔrH° | 2.3 ± 0.2 | kcal/mol | SIDT | Kemper, Hsu, et al., 1991 | gas phase; ΔrH(0 K) = 2.16, ΔrS(100 K) = 13.7 cal/mol*K |
Quantity | Value | Units | Method | Reference | Comment |
ΔrS° | 12.8 | cal/mol*K | SIDT | Kemper, Hsu, et al., 1991 | gas phase; ΔrH(0 K) = 2.16, ΔrS(100 K) = 13.7 cal/mol*K |
By formula: Rb+ + Ne = (Rb+ • Ne)
Quantity | Value | Units | Method | Reference | Comment |
---|---|---|---|---|---|
ΔrH° | 0.77 | kcal/mol | IMob | Viehland, 1984 | gas phase |
ΔrH° | 0.78 | kcal/mol | IMob | Takebe, 1983 | gas phase |
By formula: Xe+ + Ne = (Xe+ • Ne)
Quantity | Value | Units | Method | Reference | Comment |
---|---|---|---|---|---|
ΔrH° | 0.95 | kcal/mol | PI | Dehmer and Pratt, 1982 | gas phase |

References

Cox, Wagman, et al., 1984
Cox, J.D.; Wagman, D.D.; Medvedev, V.A.,
CODATA Key Values for Thermodynamics, Hemisphere Publishing Corp., New York, 1984, 1. [all data]
Chase, 1998
Chase, M.W., Jr.,
NIST-JANAF Themochemical Tables, Fourth Edition,
J. Phys. Chem. Ref. Data, Monograph 9, 1998, 1-1951. [all data]
Kemper, Hsu, et al., 1991
Kemper, P.R.; Hsu, M.T.; Bowers, M.T.,
Transition - Metal Ion - Rare Gas Clusters: Bond Strengths and Molecular Parameters for Co+(He/Ne)n, Ni+(He/Ne)n, and Cr+(He/Ne/Ar),
J. Phys. Chem., 1991, 95, 26, 10600, https://doi.org/10.1021/j100179a022
. [all data]
Gislason, 1984
Gislason, E.A.,
Quoted in I. R. Gatland in Swarms of Ions and Electrons in Gases, W. Lindinger, T. D. Mark and F. Howorka, eds. (Springer, New York, 1984, 1984, 44. [all data]
Viehland, 1984
Viehland, L.A.,
Interaction Potentials for Li+ - Rare - Gas Systems,
Chem. Phys., 1984, 78, 2, 279, https://doi.org/10.1016/0301-0104(83)85114-3
. [all data]
Takebe, 1983
Takebe, M.,
The Generalized Mobility Curve for Alkali Ions in Rare Gases: Clustering Reactions and Mobility Curves,
J. Chem. Phys., 1983, 78, 12, 7223, https://doi.org/10.1063/1.444763
. [all data]
Robson and Kumar, 1973
Robson, R.E.; Kumar, K.,
Mobility and Diffusion II. Dependence on Experimental Variables and Interaction Potential for Alkali Ions in Rare Gases,
Aust. J. Phys., 1973, 26, 2, 187, https://doi.org/10.1071/PH730187
. [all data]
Hiraoka and Mori, 1990
Hiraoka, K.; Mori, T.,
Stability of Rare - Gas Cluster Ions,
J. Chem. Phys., 1990, 92, 7, 4408, https://doi.org/10.1063/1.457751
. [all data]
Dehmer and Pratt, 1982
Dehmer, P.M.; Pratt, S.T.,
Photoionization of ArKr, ArXe, and KrXe and bond dissociation energies of the rare gas dimer ions,
J. Chem. Phys., 1982, 77, 4804. [all data]
Mittman and Weise, 1974
Mittman, H.U.; Weise, H.P.,
Scattering of Ions V. Elastic Scattering of the Symmetric Rare Gas Ion - Rare Gas Atom Systems,
Z. Naturforsch., 1974, A29, 400. [all data]