1H-Indole, 1-(trimethylsilyl)-3-[[(trimethylsilyl)oxy]methyl]-
- Formula: C15H25NOSi2
- Molecular weight: 291.5361
- IUPAC Standard InChIKey: RACUQLJSNMJBDR-UHFFFAOYSA-N
- CAS Registry Number: 74367-44-5
- Chemical structure:

Van Den Dool and Kratz RI, non-polar column, custom temperature program

Column type | Active phase | I | Reference | Comment |
---|---|---|---|---|
Capillary | VF-5MS | 1809.8 | Tret'yakov, 2008 | 30. m/0.25 mm/0.25 μm, He; Program: Multi-step temperature program; T(initial)=60C; T(final)=270C |

References

Tret'yakov, 2008
Tret'yakov, K.V.,
Retention Data. NIST Mass Spectrometry Data Center., NIST Mass Spectrometry Data Center, 2008. [all data]