1H-Indene, 2,3-dihydro-5-nitro-
- Formula: C9H9NO2
- Molecular weight: 163.1733
- IUPAC Standard InChIKey: DLURUQQMVLOLCP-UHFFFAOYSA-N
- CAS Registry Number: 7436-07-9
- Chemical structure:
View 3d structure (requires JavaScript / HTML 5) - Other names: Indan, 5-nitro-; β-Nitroindan; 5-Nitroindan; 5-Nitroindane

Lee's RI, non-polar column, temperature ramp

Column type | Active phase | I | Reference | Comment |
---|---|---|---|---|
Capillary | SE-52 | 261.38 | White, Robbat, et al., 1983 | 30. m/0.3 mm/0.25 μm, He, 4. K/min; Tstart: 25. C; Tend: 295. C |
Capillary | SE-52 | 261.18 | White, Robbat, et al., 1983 | 30. m/0.2 mm/0.25 μm, He, 4. K/min; Tstart: 25. C; Tend: 295. C |
Capillary | SE-52 | 251.36 | White, Robbat, et al., 1983 | 30. m/0.3 mm/0.25 μm, He, 4. K/min; Tstart: 100. C; Tend: 300. C |
Capillary | SE-52 | 261.65 | White, Robbat, et al., 1983 | 30. m/0.3 mm/0.25 μm, He, 4. K/min; Tstart: 40. C; Tend: 300. C |
Capillary | SE-52 | 258.41 | White, Robbat, et al., 1983 | 30. m/0.3 mm/0.25 μm, He, 4. K/min; Tstart: 70. C; Tend: 300. C |
Capillary | SE-52 | 261.55 | Vassilaros, Kong, et al., 1982 | 20. m/0.30 mm/0.25 μm, H2, 40. C @ 2. min, 4. K/min; Tend: 265. C |

Lee's RI, non-polar column, custom temperature program

Column type | Active phase | I | Reference | Comment |
---|---|---|---|---|
Capillary | OV-101 | 261.0 | Tucminen, Wickstrom, et al., 1986 | Program: not specified |

References

White, Robbat, et al., 1983
White, C.M.; Robbat, A., Jr.; Hoes, R.M.,
Gas chromatographic retention characteristics of nitrated polycyclic aromatic hydrocarbons on SE-52,
Chromatographia, 1983, 17, 11, 605-612, https://doi.org/10.1007/BF02261944
. [all data]
Vassilaros, Kong, et al., 1982
Vassilaros, D.L.; Kong, R.C.; Later, D.W.; Lee, M.L.,
Linear retention index system for polycyclic aromatic compounds. Critical evaluation and additional indices,
J. Chromatogr., 1982, 252, 1-20, https://doi.org/10.1016/S0021-9673(01)88394-1
. [all data]
Tucminen, Wickstrom, et al., 1986
Tucminen, A.; Wickstrom, K.; Pyysalo, H.,
Determination of Polycyclic Aromatic Compounds by GLC-Selected Ion Monitoring (SIM) Technique,
J. Hi. Res. Chromatogr. Chromatogr. Comm., 1986, 9, 8, 469-471, https://doi.org/10.1002/jhrc.1240090813
. [all data]