Propen-2-ol
- Formula: C3H6O
- Molecular weight: 58.0791
- IUPAC Standard InChIKey: NARVIWMVBMUEOG-UHFFFAOYSA-N
- CAS Registry Number: 74324-85-9
- Chemical structure:
View 3d structure (requires JavaScript / HTML 5) - Species with the same structure:

Kovats' RI, non-polar column, isothermal

Column type | Active phase | Temperature (C) | I | Reference | Comment |
---|---|---|---|---|---|
Packed | SE-30 | 100. | 534. | Winskowski, 1983 | Gaschrom Q; Column length: 2. m |

References

Winskowski, 1983
Winskowski, J.,
Gaschromatographische Identifizierung von Stoffen anhand von Indexziffem und unterschiedlichen Detektoren,
Chromatographia, 1983, 17, 3, 160-165, https://doi.org/10.1007/BF02271041
. [all data]