5,5,7,7-Tetramethylundecane
- Formula: C15H32
- Molecular weight: 212.4146
- IUPAC Standard InChIKey: ICXWEQZDTWZYNP-UHFFFAOYSA-N
- CAS Registry Number: 74286-95-6
- Chemical structure:
View 3d structure (requires JavaScript / HTML 5) - Permanent link for this species. Use this link for bookmarking this species for future reference.

Condensed phase thermochemistry data

Data compiled by: Hussein Y. Afeefy, Joel F. Liebman, and Stephen E. Stein
Quantity | Value | Units | Method | Reference | Comment |
---|---|---|---|---|---|
ΔcH°liquid | -10042. | kJ/mol | Ccb | Shtekher, Skuratov, et al., 1959 | Corresponding ΔfHºliquid = -433.5 kJ/mol (simple calculation by NIST; no Washburn corrections) |
ΔcH°liquid | -10026. | kJ/mol | Ccb | Skuratov, Kozina, et al., 1958 | Corresponding ΔfHºliquid = -450.2 kJ/mol (simple calculation by NIST; no Washburn corrections) |

References

Shtekher, Skuratov, et al., 1959
Shtekher, S.M.; Skuratov, S.M.; Daukshas, V.K.; Levina, R.Ya.,
Heats of combustion of some branched alkanes,
Dokl. Akad. Nauk SSSR, 1959, 127, 812-814. [all data]
Skuratov, Kozina, et al., 1958
Skuratov, S.M.; Kozina, M.P.; Shtocher, S.M.; Prevalova, N.M.; Kamkina, L.S.; Zuko, V.D.,
Heats of combustion of cyclic compounds,
Bull. Chem. Thermodyn., 1958, 1, 21. [all data]