4,4,6,6-Tetramethylnonane
- Formula: C13H28
- Molecular weight: 184.3614
- IUPAC Standard InChIKey: WLQCITPYUAWICA-UHFFFAOYSA-N
- CAS Registry Number: 74286-93-4
- Chemical structure:
View 3d structure (requires JavaScript / HTML 5) - Permanent link for this species. Use this link for bookmarking this species for future reference.

Condensed phase thermochemistry data

Data compiled by: Hussein Y. Afeefy, Joel F. Liebman, and Stephen E. Stein
Quantity | Value | Units | Method | Reference | Comment |
---|---|---|---|---|---|
ΔcH°liquid | -8746.2 | kJ/mol | Ccb | Shtekher, Skuratov, et al., 1959 | Corresponding ΔfHºliquid = -371. kJ/mol (simple calculation by NIST; no Washburn corrections) |
ΔcH°liquid | -8729.1 | kJ/mol | Ccb | Skuratov, Kozina, et al., 1958 | Corresponding ΔfHºliquid = -388. kJ/mol (simple calculation by NIST; no Washburn corrections) |

References

Shtekher, Skuratov, et al., 1959
Shtekher, S.M.; Skuratov, S.M.; Daukshas, V.K.; Levina, R.Ya.,
Heats of combustion of some branched alkanes,
Dokl. Akad. Nauk SSSR, 1959, 127, 812-814. [all data]
Skuratov, Kozina, et al., 1958
Skuratov, S.M.; Kozina, M.P.; Shtocher, S.M.; Prevalova, N.M.; Kamkina, L.S.; Zuko, V.D.,
Heats of combustion of cyclic compounds,
Bull. Chem. Thermodyn., 1958, 1, 21. [all data]