Ethyl 3-chlorobutanoate
- Formula: C6H11ClO2
- Molecular weight: 150.603
- IUPAC Standard InChIKey: ZSWGSCUZUONRDN-UHFFFAOYSA-N
- CAS Registry Number: 7425-48-1
- Chemical structure:
View 3d structure (requires JavaScript / HTML 5) - Other names: Butanoic acid, 3-chloro-, ethyl ester; Ethyl β-chlorobutyrate

Condensed phase thermochemistry data

Data compiled by: Hussein Y. Afeefy, Joel F. Liebman, and Stephen E. Stein
Quantity | Value | Units | Method | Reference | Comment |
---|---|---|---|---|---|
ΔcH°liquid | -3384. | kJ/mol | Ccb | Schjanberg, 1935 |

Kovats' RI, non-polar column, isothermal

Column type | Active phase | Temperature (C) | I | Reference | Comment |
---|---|---|---|---|---|
Capillary | SE-30 | 100. | 955. | Haken and Korhonen, 1985 | N2; Column length: 25. m; Column diameter: 0.33 mm |
Capillary | SE-30 | 120. | 947. | Haken and Korhonen, 1985 | N2; Column length: 25. m; Column diameter: 0.33 mm |
Capillary | SE-30 | 140. | 935. | Haken and Korhonen, 1985 | N2; Column length: 25. m; Column diameter: 0.33 mm |
Capillary | SE-30 | 80. | 948. | Haken and Korhonen, 1985 | N2; Column length: 25. m; Column diameter: 0.33 mm |

References

Schjanberg, 1935
Schjanberg, E.,
Die Verbrennungswarmen und die Refraktionsdaten einiger chlorsubstituierter Fettsauren und Ester.,
Z. Phys. Chem. Abt. A, 1935, 172, 197-233. [all data]
Haken and Korhonen, 1985
Haken, J.K.; Korhonen, I.O.O.,
Gas chromatography of homologous esters. XXVIII. Retention increments of aliphatic C1-C18 n-alkyl esters of butanoic acid and its monochloro derivatives on SE-30 and OV-351 capillary columns,
J. Chromatogr., 1985, 320, 2, 325-334, https://doi.org/10.1016/S0021-9673(01)90510-2
. [all data]