2-Propanone, (1-methylethyl)hydrazone
- Formula: C6H14N2
- Molecular weight: 114.1888
- IUPAC Standard InChIKey: NEMJPYNJMBONJU-UHFFFAOYSA-N
- CAS Registry Number: 7423-01-0
- Chemical structure:
View 3d structure (requires JavaScript / HTML 5) - Other names: Acetone isopropylhydrazone

Condensed phase thermochemistry data

Data compiled by: Hussein Y. Afeefy, Joel F. Liebman, and Stephen E. Stein
Quantity | Value | Units | Method | Reference | Comment |
---|---|---|---|---|---|
ΔfH°liquid | -21.3 ± 1.2 | kJ/mol | Ccb | Lebedeva, Masalitinova, et al., 1980 | |
Quantity | Value | Units | Method | Reference | Comment |
ΔcH°liquid | -4340.5 ± 1.2 | kJ/mol | Ccb | Lebedeva, Masalitinova, et al., 1980 |

Phase change data

Data compiled by: William E. Acree, Jr., James S. Chickos
Enthalpy of vaporization
ΔvapH (kJ/mol) | Temperature (K) | Reference | Comment |
---|---|---|---|
44.6 | 303. | Lebedeva, Nazarova, et al., 1980 | Based on data from 288. to 323. K. |

Normal alkane RI, non-polar column, temperature ramp

Column type | Active phase | I | Reference | Comment |
---|---|---|---|---|
Capillary | OV-101 | 828. | Zenkevich, 2005 | 25. m/0.20 mm/0.10 μm, N2/He, 6. K/min; Tstart: 50. C; Tend: 250. C |

References

Lebedeva, Masalitinova, et al., 1980
Lebedeva, N.D.; Masalitinova, T.N.; Ryadnenko, V.L.; Monyakova, O.N.,
Enthalpies of combustion and formation of alkyl-substituted hydrazones,
J. Appl. Chem. USSR, 1980, 53, 1800-1803. [all data]
Lebedeva, Nazarova, et al., 1980
Lebedeva, N.D.; Nazarova, L.F.; Katin, Y.A.,
Zh. Prikl. Khim. (Leningrad), 1980, 53, 1394. [all data]
Zenkevich, 2005
Zenkevich, I.G.,
Experimentally measured retention indices., 2005. [all data]