2-Butenal, dimethylhydrazone
- Formula: C6H12N2
- Molecular weight: 112.1729
- IUPAC Standard InChIKey: KVKJBRFOURXWON-DBYMJTHYSA-N
- CAS Registry Number: 7422-95-9
- Chemical structure:
View 3d structure (requires JavaScript / HTML 5) - Other names: 2-Butenylaldehyde dimethylhydrazoene

Normal alkane RI, non-polar column, temperature ramp

Column type | Active phase | I | Reference | Comment |
---|---|---|---|---|
Capillary | OV-101 | 940. | Zenkevich, 2005 | 25. m/0.20 mm/0.10 μm, N2/He, 6. K/min; Tstart: 50. C; Tend: 250. C |

References

Zenkevich, 2005
Zenkevich, I.G.,
Experimentally measured retention indices., 2005. [all data]