Acetaldehyde, diethylhydrazone
- Formula: C6H14N2
- Molecular weight: 114.1888
- IUPAC Standard InChIKey: XUPJINYFRLDNCY-UHFFFAOYSA-N
- CAS Registry Number: 7422-91-5
- Chemical structure:
View 3d structure (requires JavaScript / HTML 5) - Other names: Ethanal, diethylhydrazone

Kovats' RI, non-polar column, isothermal

Column type | Active phase | Temperature (C) | I | Reference | Comment |
---|---|---|---|---|---|
Capillary | HP-1 | 60. | 820. | Király, Körtvélyesi, et al., 1996 | 50. m/0.32 mm/0.52 μm, N2 |
Capillary | HP-5 | 60. | 836.1 | Király, Körtvélyesi, et al., 1996 | 50. m/0.32 mm/0.52 μm, N2 |

Normal alkane RI, non-polar column, temperature ramp

Column type | Active phase | I | Reference | Comment |
---|---|---|---|---|
Capillary | OV-101 | 830. | Zenkevich, 2005 | 25. m/0.20 mm/0.10 μm, N2/He, 6. K/min; Tstart: 50. C; Tend: 250. C |

References

Király, Körtvélyesi, et al., 1996
Király, Z.; Körtvélyesi, T.; Seres, L.; Görgényi, M.,
Structure-retention relationships in the gas chromatography of N,N-dialkylhydrazones,
Chromatographia, 1996, 42, 11/12, 653-659, https://doi.org/10.1007/BF02267697
. [all data]
Zenkevich, 2005
Zenkevich, I.G.,
Experimentally measured retention indices., 2005. [all data]