Hydrazine, 2-propenyl-
- Formula: C3H8N2
- Molecular weight: 72.1090
- IUPAC Standard InChIKey: ZTILHLWDFSMCLZ-UHFFFAOYSA-N
- CAS Registry Number: 7422-78-8
- Chemical structure:
View 3d structure (requires JavaScript / HTML 5) - Other names: Hydrazine, allyl-; Allylhydrazine

Normal alkane RI, non-polar column, temperature ramp

Column type | Active phase | I | Reference | Comment |
---|---|---|---|---|
Capillary | OV-101 | 738. | Zenkevich, 2005 | 25. m/0.20 mm/0.10 μm, N2/He, 6. K/min; Tstart: 50. C; Tend: 250. C |

References

Zenkevich, 2005
Zenkevich, I.G.,
Experimentally measured retention indices., 2005. [all data]