Lysine, 3TMS derivative
- Formula: C15H38N2O2Si3
- Molecular weight: 362.7309
- IUPAC Standard InChIKey: CONSIAKXDFYFFH-UHFFFAOYSA-N
- CAS Registry Number: 7415-18-1
- Chemical structure:
View 3d structure (requires JavaScript / HTML 5) - Other names: N,N',o-Tris-(trimethylsilyl)lysine

Kovats' RI, non-polar column, isothermal

Column type | Active phase | Temperature (C) | I | Reference | Comment |
---|---|---|---|---|---|
Capillary | SP-2100 | 150. | 1953.89 | Gajewski, Dizdaroglu, et al., 1982 | He; Column length: 12. m; Column diameter: 0.2 mm |
Capillary | SP-2100 | 210. | 1950.38 | Gajewski, Dizdaroglu, et al., 1982 | He; Column length: 12. m; Column diameter: 0.2 mm |
Capillary | SE-54 | 150. | 1947.43 | Gajewski, Dizdaroglu, et al., 1982 | He; Column length: 12. m; Column diameter: 0.2 mm |
Capillary | SE-54 | 190. | 1941.81 | Gajewski, Dizdaroglu, et al., 1982 | He; Column length: 12. m; Column diameter: 0.2 mm |

Kovats' RI, non-polar column, temperature ramp

Column type | Active phase | I | Reference | Comment |
---|---|---|---|---|
Capillary | SP-2100 | 1958.35 | Gajewski, Dizdaroglu, et al., 1982 | He, 6. K/min; Column length: 12. m; Column diameter: 0.2 mm; Tstart: 80. C; Tend: 250. C |

Kovats' RI, non-polar column, custom temperature program

Column type | Active phase | I | Reference | Comment |
---|---|---|---|---|
Capillary | SE-54 | 1952.97 | Gajewski, Dizdaroglu, et al., 1982 | He; Column length: 12. m; Column diameter: 0.2 mm; Program: 70C => 4C/min => 170C=8C/min => 250C |

Van Den Dool and Kratz RI, non-polar column, temperature ramp

Column type | Active phase | I | Reference | Comment |
---|---|---|---|---|
Packed | OV-1 | 1956. | Butts, 1972 | He, Chromosorb W HP (80-100 mesh), 10. K/min; Column length: 2. m; Tstart: 100. C; Tend: 325. C |

Van Den Dool and Kratz RI, non-polar column, custom temperature program

Column type | Active phase | I | Reference | Comment |
---|---|---|---|---|
Capillary | VF-5MS | 1687.1 | Tret'yakov, 2007 | 30. m/0.25 mm/0.25 μm, He; Program: Multi-step temperature program; T(initial)=60C; T(final)=270C |

References

Gajewski, Dizdaroglu, et al., 1982
Gajewski, E.; Dizdaroglu, M.; Simic, M.G.,
Kovats' Indices of Trimethylsilylated Amino Acids on Fused-Silica Capillary Columns,
J. Chromatogr., 1982, 249, 1, 41-55, https://doi.org/10.1016/S0021-9673(00)80231-9
. [all data]
Butts, 1972
Butts, W.C.,
Two-Column Gas Chromatography of Trimethylsilyl Derivatives of Biochemically Significant Compounds,
Anal. Biochemistry, 1972, 46, 1, 187-199, https://doi.org/10.1016/0003-2697(72)90411-3
. [all data]
Tret'yakov, 2007
Tret'yakov, K.V.,
Retention Data. NIST Mass Spectrometry Data Center., NIST Mass Spectrometry Data Center, 2007. [all data]