N-Benzylpalmitamide
- Formula: C23H39NO
- Molecular weight: 345.5619
- IUPAC Standard InChIKey: MLGPKWUKOQAAGI-UHFFFAOYSA-N
- CAS Registry Number: 74058-71-2
- Chemical structure:
View 3d structure (requires JavaScript / HTML 5) - Other names: Hexadecanamide, N-(phenylmethyl)-; Hexadecanamide, N-benzyl-; Macamide 1; N-Benzylhexadecanamide

Phase change data

Data compiled by: Thermodynamics Research Center, NIST Boulder Laboratories, Chris Muzny director
Quantity | Value | Units | Method | Reference | Comment |
---|---|---|---|---|---|
Tfus | 368.25 | K | N/A | Mod, Magne, et al., 1962 | Uncertainty assigned by TRC = 0.5 K |

References

Mod, Magne, et al., 1962
Mod, R.R.; Magne, F.C.; Skau, E.L.,
J. Chem. Eng. Data, 1962, 7, 31. [all data]