Dimethyl 3-thiaadipate
- Formula: C7H12O4S
- Molecular weight: 192.233
- IUPAC Standard InChIKey: XNDKLLFGXIEGKL-UHFFFAOYSA-N
- CAS Registry Number: 7400-45-5
- Chemical structure:
View 3d structure (requires JavaScript / HTML 5) - Other names: Propanoic acid, 3-[(2-methoxy-2-oxoethyl)thio]-, methyl ester; Methyl 3-(methoxycarbonylmethylthio)propionate; Propanoic acid, 3-(carbomethoxymethylthio)-, methyl ester; Propanoic acid, 3-(((methoxycarbonyl)methyl)thio)-, methyl ester; methyl 3-[(2-methoxy-2-oxoethyl)thio]propionate

Phase change data

Data compiled by: Robert L. Brown and Stephen E. Stein
Reduced pressure boiling point
Tboil (K) | Pressure (bar) | Reference |
---|---|---|
414. to 415. | 0.017 | Frinton Laboratories Inc., 1986 |

References

Frinton Laboratories Inc., 1986
Frinton Laboratories Inc.,
Catalog Number 11, Frinton Laboratories Inc., Vineland, NJ, 1986, 99. [all data]