o-Isopropenyltoluene
- Formula: C10H12
- Molecular weight: 132.2023
- IUPAC Standard InChIKey: OGMSGZZPTQNTIK-UHFFFAOYSA-N
- CAS Registry Number: 7399-49-7
- Chemical structure:
View 3d structure (requires JavaScript / HTML 5) - Other names: 1-Methyl-2-iso-propenylbenzene; Benzene, 1-methyl-2-(1-methylethenyl)-; o-Methyl-α-methylstyrene; o,α-Dimethylstyrene; Styrene, o,α-dimethyl-; 1-Isopropenyl-2-methylbenzene; 1-Methyl-2-(1-methylethenyl)-benzene; o-Cymenene

Phase change data

Data compiled by: Thermodynamics Research Center, NIST Boulder Laboratories, Chris Muzny director
Quantity | Value | Units | Method | Reference | Comment |
---|---|---|---|---|---|
Tboil | 445.35 | K | N/A | Anonymous, 1952 | Uncertainty assigned by TRC = 1. K |
Tboil | 442. | K | N/A | Pines, Strehlau, et al., 1950 | Uncertainty assigned by TRC = 3. K |
Tboil | 441.65 | K | N/A | Pines, Strehlau, et al., 1950, 2 | Uncertainty assigned by TRC = 2. K |
Tboil | 445.65 | K | N/A | Murray and Gallaway, 1948 | Uncertainty assigned by TRC = 2. K |
Tboil | 448.15 | K | N/A | Sabatier and Murat, 1913 | Uncertainty assigned by TRC = 3. K |

Gas phase ion energetics data

Data evaluated by: Edward P. Hunter and Sharon G. Lias
Quantity | Value | Units | Method | Reference | Comment |
---|---|---|---|---|---|
Proton affinity (review) | 857.8 | kJ/mol | N/A | Hunter and Lias, 1998 | |
Quantity | Value | Units | Method | Reference | Comment |
Gas basicity | 828.9 | kJ/mol | N/A | Hunter and Lias, 1998 |

Kovats' RI, non-polar column, isothermal

Column type | Active phase | Temperature (C) | I | Reference | Comment |
---|---|---|---|---|---|
Capillary | HP-1 | 60. | 1116. | Zhang, Li, et al., 1992 | N2; Column length: 25. m; Column diameter: 0.20 mm |
Capillary | HP-1 | 60. | 1117. | Zhang, Li, et al., 1992 | N2; Column length: 25. m; Column diameter: 0.20 mm |

References

Anonymous, 1952
Anonymous, R.,
, Physical Properties of Chemical Substances, Dow Chemical Co., 1952. [all data]
Pines, Strehlau, et al., 1950
Pines, H.; Strehlau, D.R.; Ipatieff, V.N.,
Hydrogen Transfer IV. Reaction of p-Isobutyltoluene and of p-s-Butyltoluene with Methylcyclohexene,
J. Am. Chem. Soc., 1950, 72, 1563. [all data]
Pines, Strehlau, et al., 1950, 2
Pines, H.; Strehlau, D.R.; Ipatieff, V.N.,
Hydrogen Transfer V. Reaction of m-Cymene and o-Cymene with Methylcyclohexane in the Presence of Hydrogen FLuoride,
J. Am. Chem. Soc., 1950, 72, 5521. [all data]
Murray and Gallaway, 1948
Murray, M.J.; Gallaway, W.S.,
Steric Inhibition of Resonance in 1-Methyl-2-isopropenylbenzene,
J. Am. Chem. Soc., 1948, 70, 3867. [all data]
Sabatier and Murat, 1913
Sabatier, P.; Murat, M.,
Preparation of Three Cymenes and Thre Menthanes,
C. R. Hebd. Seances Acad. Sci., 1913, 156, 184. [all data]
Hunter and Lias, 1998
Hunter, E.P.; Lias, S.G.,
Evaluated Gas Phase Basicities and Proton Affinities of Molecules: An Update,
J. Phys. Chem. Ref. Data, 1998, 27, 3, 413-656, https://doi.org/10.1063/1.556018
. [all data]
Zhang, Li, et al., 1992
Zhang, M.J.; Li, S.D.; Chen, B.J.,
Compositional studies of high-temperature coal tar by GC/FTIR analysis of light oil fractions,
Chromatographia, 1992, 33, 3/4, 138-146, https://doi.org/10.1007/BF02275894
. [all data]