chlorocyclopropane
- Formula: C3H5Cl
- Molecular weight: 76.525
- IUPAC Standard InChIKey: VEZNCHDBSQWUHQ-UHFFFAOYSA-N
- CAS Registry Number: 7393-45-5
- Chemical structure:
View 3d structure (requires JavaScript / HTML 5) - Other names: cyclopropyl chloride

Phase change data

Data compiled by: Thermodynamics Research Center, NIST Boulder Laboratories, Chris Muzny director
Quantity | Value | Units | Method | Reference | Comment |
---|---|---|---|---|---|
Tboil | 316.58 | K | N/A | Slabey, 1952 | Uncertainty assigned by TRC = 0.3 K |
Quantity | Value | Units | Method | Reference | Comment |
Tfus | 175.47 | K | N/A | Slabey, 1952 | Uncertainty assigned by TRC = 0.3 K |

References

Slabey, 1952
Slabey, V.A.,
Reaction of Cyclopropyl Chloride with Lithium. Isolation of Dicyclopropyl,
J. Am. Chem. Soc., 1952, 74, 4928-30. [all data]