N-Methyl hexadecanamide

Phase change data

Data compiled by: William E. Acree, Jr., James S. Chickos

Enthalpy of sublimation

ΔsubH (kJ/mol) Temperature (K) Method Reference Comment
144.5 ± 0.8350.GSDavies and Jones, 1959Based on data from 345. - 355. K. See also Stephenson and Malanowski, 1987.

References

Davies and Jones, 1959
Davies, Mansel; Jones, A. Hamilton, Lattice energies of some n-methyl amides and of some carbamates, Trans. Faraday Soc., 1959, 55, 1329, https://doi.org/10.1039/tf9595501329 . [all data]

Stephenson and Malanowski, 1987
Stephenson, Richard M.; Malanowski, Stanislaw, Handbook of the Thermodynamics of Organic Compounds, 1987, https://doi.org/10.1007/978-94-009-3173-2 . [all data]