3-Hexanone, 2-methyl-
- Formula: C7H14O
- Molecular weight: 114.1855
- IUPAC Standard InChIKey: HIGGFWFRAWSMBR-UHFFFAOYSA-N
- CAS Registry Number: 7379-12-6
- Chemical structure:
View 3d structure (requires JavaScript / HTML 5) - Other names: Isopropyl propyl ketone; Propyl isopropyl ketone; 2-Methyl-3-hexanone; 2-Methylhexan-3-one

Phase change data

Data compiled as indicated in comments:
BS - Robert L. Brown and Stephen E. Stein
TRC - Thermodynamics Research Center, NIST Boulder Laboratories, Chris Muzny director
AC - William E. Acree, Jr., James S. Chickos
Quantity | Value | Units | Method | Reference | Comment |
---|---|---|---|---|---|
Tboil | 407. ± 5. | K | AVG | N/A | Average of 13 values; Individual data points |
Enthalpy of vaporization
ΔvapH (kJ/mol) | Temperature (K) | Method | Reference | Comment |
---|---|---|---|---|
41.3 | 311. | A | Stephenson and Malanowski, 1987 | Based on data from 296. to 406. K.; AC |

Kovats' RI, non-polar column, isothermal

View large format table.

Column type Active phase Temperature (C) I Reference Comment
CapillaryOV-1333.820.Hu, Lu, et al., 2006

Normal alkane RI, non-polar column, isothermal

View large format table.

Column type Active phase Temperature (C) I Reference Comment
CapillaryOV-160.819.Amboni, Junkes, et al., 2002

Normal alkane RI, non-polar column, temperature ramp

View large format table.

Column type Active phase I Reference Comment
CapillaryMDN-5784.van Loon, Linssen, et al., 200560. m/0.25 mm/0.25 μm, He, 40. C @ 4. min, 4. K/min, 270. C @ 5. min

Normal alkane RI, non-polar column, custom temperature program

View large format table.

Column type Active phase I Reference Comment
CapillaryMethyl Silicone820.Feng and Mu, 2007Program: not specified
CapillaryPolydimethyl siloxane819.Junkes, Castanho, et al., 2003Program: not specified
CapillaryMethyl Silicone820.Estrada and Gutierrez, 1999Program: not specified

References

Stephenson and Malanowski, 1987
Stephenson, Richard M.; Malanowski, Stanislaw,
Handbook of the Thermodynamics of Organic Compounds, 1987, https://doi.org/10.1007/978-94-009-3173-2
. [all data]