N,N-Dimethyloctylamine
- Formula: C10H23N
- Molecular weight: 157.2963
- IUPAC Standard InChIKey: UQKAOOAFEFCDGT-UHFFFAOYSA-N
- CAS Registry Number: 7378-99-6
- Chemical structure:
View 3d structure (requires JavaScript / HTML 5) - Other names: N,N-Dimethyl-n-octylamine; N-(n-Octyl)dimethylamine; 1-Octanamine, N,N-dimethyl-; Dimethyl-n-octylamine; Dimethyloctylamine; N-Octyldimethylamine; Octylamine, N,N-dimethyl-; Octyldimethylamine; N,N-Dimethyl-1-octanamine

Phase change data

Data compiled as indicated in comments:
BS - Robert L. Brown and Stephen E. Stein
TRC - Thermodynamics Research Center, NIST Boulder Laboratories, Chris Muzny director
AC - William E. Acree, Jr., James S. Chickos
Quantity | Value | Units | Method | Reference | Comment |
---|---|---|---|---|---|
Tboil | 468.2 | K | N/A | Aldrich Chemical Company Inc., 1990 | BS |
Tboil | 462.65 | K | N/A | Gautier, Renault, et al., 1957 | Uncertainty assigned by TRC = 3. K; TRC |
Tboil | 464.15 | K | N/A | Clarke, 1913 | Uncertainty assigned by TRC = 3. K; TRC |
Tboil | 467.15 | K | N/A | Von Braun, 1911 | Uncertainty assigned by TRC = 3. K; TRC |
Enthalpy of vaporization
ΔvapH (kJ/mol) | Temperature (K) | Method | Reference | Comment |
---|---|---|---|---|
54.0 ± 0.5 | 303. | N/A | Verevkin, 1997 | Based on data from 284. to 323. K.; AC |
50.2 | 386. | A | Stephenson and Malanowski, 1987 | Based on data from 371. to 517. K.; AC |

Normal alkane RI, non-polar column, temperature ramp

Column type | Active phase | I | Reference | Comment |
---|---|---|---|---|
Capillary | Ultra-1 | 1099. | Okumura, 1991 | 25. m/0.32 mm/0.25 μm, He, 3. K/min; Tstart: 80. C; Tend: 260. C |

References

Aldrich Chemical Company Inc., 1990
Aldrich Chemical Company Inc.,
Catalog Handbook of Fine Chemicals, Aldrich Chemical Company, Inc., Milwaukee WI, 1990, 1. [all data]
Gautier, Renault, et al., 1957
Gautier; Renault; Rabiant,
Bull. Soc. Chim. Fr., 1957, 1957, 1014. [all data]
Clarke, 1913
Clarke, H.T.,
THe Relation Between Residual Affinity and Chemical Constitution. Part IV. Some Open-chain Compounds,
J. Chem. Soc., Trans., 1913, 103, 1689. [all data]
Von Braun, 1911
Von Braun, J.,
On the Decomposition of Quaternary Ammonium Hydroxide,
Justus Liebigs Ann. Chem., 1911, 382, 1. [all data]
Verevkin, 1997
Verevkin, Sergey P.,
Thermochemistry of amines: experimental standard molar enthalpies of formation of some aliphatic and aromatic amines,
The Journal of Chemical Thermodynamics, 1997, 29, 8, 891-899, https://doi.org/10.1006/jcht.1997.0212
. [all data]
Stephenson and Malanowski, 1987
Stephenson, Richard M.; Malanowski, Stanislaw,
Handbook of the Thermodynamics of Organic Compounds, 1987, https://doi.org/10.1007/978-94-009-3173-2
. [all data]
Okumura, 1991
Okumura, T.,
retention indices of environmental chemicals on methyl silicone capillary column,
Journal of Environmental Chemistry (Japan), 1991, 1, 2, 333-358, https://doi.org/10.5985/jec.1.333
. [all data]