Dibenzothiophene, 4-methyl-
- Formula: C13H10S
- Molecular weight: 198.283
- IUPAC Standard InChIKey: NICUQYHIOMMFGV-UHFFFAOYSA-N
- CAS Registry Number: 7372-88-5
- Chemical structure:
View 3d structure (requires JavaScript / HTML 5) - Other names: 4-Methyldibenzothiophene

Phase change data

Data compiled by: William E. Acree, Jr., James S. Chickos
Quantity | Value | Units | Method | Reference | Comment |
---|---|---|---|---|---|
ΔsubH° | 90.3 ± 0.7 | kJ/mol | C | Freitas, Gomes, et al., 2010 |

Normal alkane RI, non-polar column, temperature ramp

Data compiled by: NIST Mass Spectrometry Data Center, William E. Wallace, director

Column type CapillaryCapillary
Active phase DB-PetroPONA
Column length (m) 50.50.
Carrier gas He
Substrate
Column diameter (mm) 0.200.20
Phase thickness (μm) 0.500.50
Tstart (C) 35.120.
Tend (C) 300.270.
Heat rate (K/min) 2.1.5
Initial hold (min) 5.
Final hold (min) 5.10.
I 1932.1927.
ReferenceLu, Wu, et al., 2004Yang, Wang, et al., 2002
Comment MSDC-RI MSDC-RI

Normal alkane RI, non-polar column, custom temperature program

Data compiled by: NIST Mass Spectrometry Data Center, William E. Wallace, director

Column type Capillary
Active phase DB-Petro
Column length (m) 50.
Carrier gas He
Substrate
Column diameter (mm) 0.20
Phase thickness (μm) 0.50
Program not specified
I 1927.
ReferenceLu, Wu, et al., 2004
Comment MSDC-RI

Lee's RI, non-polar column, temperature ramp

View large format table.

Column type Active phase I Reference Comment
CapillaryRxi-5 MS312.22Zeigler, Schantz, et al., 201230. m/0.25 mm/0.25 μm, Helium, 60. C @ 1. min, 5. K/min, 340. C @ 0. min
CapillaryDB-5MS311.95Sun, Zhou, et al., 200830. m/0.25 mm/0.25 μm, 50. C @ 2. min, 6. K/min, 300. C @ 16. min
CapillaryDB-5MS311.92Schade and Andersson, 200630. m/0.25 mm/0.25 μm, He, 60. C @ 1. min, 10. K/min; Tend: 300. C
CapillaryHP-5317.78Marynowski, Pieta, et al., 200460. m/0.25 mm/0.25 μm, He, 3. K/min; Tstart: 35. C; Tend: 300. C
CapillaryHP-5MS312.00Zhou, Wang, et al., 200430. m/0.25 mm/0.25 μm, 65. C @ 5. min, 3. K/min, 290. C @ 20. min
CapillaryDB-5311.9Becker and Colmsjö, 199830. m/0.25 mm/0.25 μm, He, 110. C @ 1. min, 10. K/min, 325. C @ 5. min
CapillaryDB-5312.73Williams and Bottrill, 1995He, 60. C @ 2. min, 5. K/min; Column length: 25. m; Column diameter: 0.3 mm; Tend: 270. C
CapillaryDB-5312.22Wang, Fingas, et al., 199430. m/0.32 mm/0.25 μm, He, 50. C @ 2. min, 6. K/min; Tend: 300. C
CapillarySE-30313.17Wang, Xue, et al., 1994Nitrogen, 4. K/min; Column length: 25. m; Column diameter: 0.20 mm; Tstart: 80. C; Tend: 290. C
CapillaryCP Sil 8 CB312.4Bundt, Herbel, et al., 199150. m/0.25 mm/0.25 μm, He, 4. K/min; Tstart: 80. C; Tend: 300. C
CapillaryDB-5312.6Palmentier, Britten, et al., 198980. C @ 1. min, 3.5 K/min, 300. C @ 10. min; Column length: 30. m; Column diameter: 0.32 mm
CapillaryDB-5312.7Palmentier, Britten, et al., 198980. C @ 1. min, 3.5 K/min, 300. C @ 10. min; Column length: 30. m; Column diameter: 0.32 mm
CapillaryOV-73312.5Arpino, Ignatiadis, et al., 198768. m/0.28 mm/0.15 μm, 1.5 K/min
CapillaryDB-5315.2Viau, Studak, et al., 1984Helium, 4. K/min; Column length: 30. m; Column diameter: 0.32 mm; Tstart: 90. C; Tend: 250. C
CapillarySE-52312.72Vassilaros, Kong, et al., 198220. m/0.30 mm/0.25 μm, H2, 40. C @ 2. min, 4. K/min; Tend: 265. C

Lee's RI, non-polar column, custom temperature program

View large format table.

Column type Active phase I Reference Comment
CapillaryHP-5MS311.80Zhou, Wang, et al., 200430. m/0.25 mm/0.25 μm; Program: not specified
CapillaryDB-5310.76Mössner, de Alda, et al., 199960. m/0.25 mm/0.25 μm, He; Program: 60C (1 min) => 45 C/min => 150C (2 min) => 2 C/min => 300 C (25 min)
CapillaryDB-5310.9Becker and Colmsjö, 199830. m/0.25 mm/0.25 μm, He; Program: 110C(1min) => 40C/min => 160C => 10C/min => 300C925min)
CapillaryDB-5310.3Becker and Colmsjö, 199830. m/0.25 mm/0.25 μm, He; Program: 35C(2min) => 25C/min => 160C => 3C/min => 300C(25min)
CapillaryHP-5311.8Becker, Nilsson, et al., 199850. m/0.32 mm/0.5 μm, He; Program: 35C => 25C/min => 160C => 3C/min => 300C(50min)
CapillaryDB-5311.34Zamperlini, Silva, et al., 199730. m/0.25 mm/0.25 μm, He; Program: 90C (1min) => 10C/min => 120C => 4C/min => 310C (20min)
CapillarySE-30312.72Wang, Xue, et al., 1994Nitrogen; Column length: 25. m; Column diameter: 0.20 mm; Program: not specified
CapillaryDB-5313.7Paschke, Herbel, et al., 199230. m/0.25 mm/0.25 μm, He; Program: 60 0C (3 min) 10 0C/min -> 100 0C (3 min) 5 0C/min -> 300 0C
CapillaryCP Sil 8 CB312.5Bundt, Herbel, et al., 199150. m/0.25 mm/0.25 μm, He; Program: not specified
CapillaryCP Sil 8 CB312.6Bundt, Herbel, et al., 199150. m/0.25 mm/0.25 μm, He; Program: not specified

References

Freitas, Gomes, et al., 2010
Freitas, Vera L.S.; Gomes, José R.B.; Ribeiro da Silva, Maria D.M.C.,
Molecular energetics of 4-methyldibenzothiophene: An experimental study,
The Journal of Chemical Thermodynamics, 2010, 42, 2, 251-255, https://doi.org/10.1016/j.jct.2009.08.010
. [all data]