4,5,6,7,8,8-Hexachloro-3a,4,7,7a-tetrahydro-4,7-methanoisobenzofuran-1,3-dione

Phase change data

Data compiled as indicated in comments:
TRC - Thermodynamics Research Center, NIST Boulder Laboratories, Chris Muzny director
AC - William E. Acree, Jr., James S. Chickos

Quantity Value Units Method Reference Comment
Ttriple506.KN/AWeinstein, Leffler, et al., 1984Crystal phase 1 phase; Uncertainty assigned by TRC = 2. K; TRC

Enthalpy of fusion

ΔfusH (kJ/mol) Temperature (K) Method Reference Comment
2.67506.DSCWeinstein, Leffler, et al., 1984, 2AC

In addition to the Thermodynamics Research Center (TRC) data available from this site, much more physical and chemical property data is available from the following TRC products:

References

Weinstein, Leffler, et al., 1984
Weinstein, D.I.; Leffler, A.J.; Currie, J.A., Phase Transitions in Bicyclic Compounds, Mol. Cryst. Liq. Cryst., 1984, 104, 95. [all data]

Weinstein, Leffler, et al., 1984, 2
Weinstein, D.I.; Leffler, A.J.; Currie, J.A., Phase Transitions In Bicyclic Compounds, Molecular Crystals and Liquid Crystals, 1984, 104, 1-2, 95-109, https://doi.org/10.1080/00268948408070401 . [all data]