L-Serine, 3TMS derivative
- Formula: C12H31NO3Si3
- Molecular weight: 321.6359
- IUPAC Standard InChIKey: MBEDINMZZORSJN-LLVKDONJSA-N
- CAS Registry Number: 7364-48-9
- Chemical structure:
- Other names: L-Serine, N,O-bis(trimethylsilyl)-, trimethylsilyl ester; Alanine, 3-(trimethylsiloxy)-N-(trimethylsilyl)-, trimethylsilyl ester, L-; N,O,O-Tris(trimethylsilyl)-L-serine; Tris(trimethylsilyl)-L-serine; Serine, N,O,O-tris(trimethylsilyl)-; Ser, tri-TMS; Ser, TMS; Serine, bis-TMS

Kovats' RI, non-polar column, isothermal

Column type | Active phase | Temperature (C) | I | Reference | Comment |
---|---|---|---|---|---|
Capillary | SP-2100 | 90. | 1383.95 | Gajewski, Dizdaroglu, et al., 1982 | He; Column length: 12. m; Column diameter: 0.2 mm |
Capillary | SE-54 | 85. | 1388.23 | Gajewski, Dizdaroglu, et al., 1982 | He; Column length: 12. m; Column diameter: 0.2 mm |

Kovats' RI, non-polar column, temperature ramp

Column type | Active phase | I | Reference | Comment |
---|---|---|---|---|
Capillary | SP-2100 | 1383.44 | Gajewski, Dizdaroglu, et al., 1982 | He, 6. K/min; Column length: 12. m; Column diameter: 0.2 mm; Tstart: 80. C; Tend: 250. C |

Kovats' RI, non-polar column, custom temperature program

Column type | Active phase | I | Reference | Comment |
---|---|---|---|---|
Capillary | SE-54 | 1388.61 | Gajewski, Dizdaroglu, et al., 1982 | He; Column length: 12. m; Column diameter: 0.2 mm; Program: 70C => 4C/min => 170C=8C/min => 250C |

Kovats' RI, polar column, isothermal

Column type | Active phase | Temperature (C) | I | Reference | Comment |
---|---|---|---|---|---|
Capillary | Carbowax 20M | 75. | 1476.09 | Gajewski, Dizdaroglu, et al., 1982 | He; Column length: 12. m; Column diameter: 0.2 mm |

Van Den Dool and Kratz RI, non-polar column, temperature ramp

Column type | Active phase | I | Reference | Comment |
---|---|---|---|---|
Packed | OV-1 | 1380. | Butts, 1972 | He, Chromosorb W HP (80-100 mesh), 10. K/min; Column length: 2. m; Tstart: 100. C; Tend: 325. C |

References

Gajewski, Dizdaroglu, et al., 1982
Gajewski, E.; Dizdaroglu, M.; Simic, M.G.,
Kovats' Indices of Trimethylsilylated Amino Acids on Fused-Silica Capillary Columns,
J. Chromatogr., 1982, 249, 1, 41-55, https://doi.org/10.1016/S0021-9673(00)80231-9
. [all data]
Butts, 1972
Butts, W.C.,
Two-Column Gas Chromatography of Trimethylsilyl Derivatives of Biochemically Significant Compounds,
Anal. Biochemistry, 1972, 46, 1, 187-199, https://doi.org/10.1016/0003-2697(72)90411-3
. [all data]