Sarcosine, 2TMS derivative
- Formula: C9H23NO2Si2
- Molecular weight: 233.4554
- IUPAC Standard InChIKey: NBSLFBORXHPAGU-UHFFFAOYSA-N
- CAS Registry Number: 7364-43-4
- Chemical structure:
View 3d structure (requires JavaScript / HTML 5) - Other names: Bis(trimethylsilyl)sarcosine; N,o-Bis-(trimethylsilyl)sarcosine; Trimethylsilyl [methyl(trimethylsilyl)amino]acetate; Sar, di-TMS; Sarcosine, N,O-bis-TMS; Sar, TMS

Van Den Dool and Kratz RI, non-polar column, temperature ramp

Column type | Active phase | I | Reference | Comment |
---|---|---|---|---|
Packed | OV-1 | 1143. | Butts, 1972 | He, Chromosorb W HP (80-100 mesh), 10. K/min; Column length: 2. m; Tstart: 100. C; Tend: 325. C |

Normal alkane RI, non-polar column, temperature ramp

Column type | Active phase | I | Reference | Comment |
---|---|---|---|---|
Capillary | HP-5MS | 1161. | Lee, Yanamandra, et al., 2002 | 30. m/0.25 mm/0.25 μm, He, 70. C @ 3. min, 4. K/min, 280. C @ 3. min |

References

Butts, 1972
Butts, W.C.,
Two-Column Gas Chromatography of Trimethylsilyl Derivatives of Biochemically Significant Compounds,
Anal. Biochemistry, 1972, 46, 1, 187-199, https://doi.org/10.1016/0003-2697(72)90411-3
. [all data]
Lee, Yanamandra, et al., 2002
Lee, B.Y.; Yanamandra, K.; Thurmon, T.F.,
Quantitative estimation of organic analytes with a capillary column,
Am. Clin. Lab., 2002, May, 30-34. [all data]