L-Serine, N-glycyl-
- Formula: C5H10N2O4
- Molecular weight: 162.1439
- IUPAC Standard InChIKey: BCCRXDTUTZHDEU-GSVOUGTGSA-N
- CAS Registry Number: 7361-43-5
- Chemical structure:

Reaction thermochemistry data

Data compiled by: Robert C. Dunbar
Individual Reactions
By formula: Na+ + C5H10N2O4 = (Na+ • C5H10N2O4)
Free energy of reaction
ΔrG° (kcal/mol) | T (K) | Method | Reference |
---|---|---|---|
37.4 | 0. | CIDC | Feng, Gronert, et al., 1999 |

Gas phase ion energetics data

Data evaluated as indicated in comments:
HL - Edward P. Hunter and Sharon G. Lias
Data compiled as indicated in comments:
MM - Michael M. Meot-Ner (Mautner)
Quantity | Value | Units | Method | Reference | Comment |
---|---|---|---|---|---|
Gas basicity | 211.9 | kcal/mol | N/A | Hunter and Lias, 1998 | HL |
Gas basicity at 298K
Gas basicity (review) (kcal/mol) | Reference | Comment |
---|---|---|
213.4 ± 0.41 | Bouchoux and Salpin, 2003 | T = 298K; MM |

Ion clustering data

Data compiled by: Robert C. Dunbar
Clustering reactions
By formula: Na+ + C5H10N2O4 = (Na+ • C5H10N2O4)
Free energy of reaction
ΔrG° (kcal/mol) | T (K) | Method | Reference |
---|---|---|---|
37.4 | 0. | CIDC | Feng, Gronert, et al., 1999 |

References

Feng, Gronert, et al., 1999
Feng, W.Y.; Gronert, S.; Lebrilla, C.B.,
Lithium and sodium ion binding energies of N-acetyl and N-glycyl amino acids,
J. Am. Chem. Soc., 1999, 121, 6, 1365, https://doi.org/10.1021/ja983116s
. [all data]
Hunter and Lias, 1998
Hunter, E.P.; Lias, S.G.,
Evaluated Gas Phase Basicities and Proton Affinities of Molecules: An Update,
J. Phys. Chem. Ref. Data, 1998, 27, 3, 413-656, https://doi.org/10.1063/1.556018
. [all data]
Bouchoux and Salpin, 2003
Bouchoux, G.; Salpin, J.Y.,
Gas-phase basicity of glycine, alanine, proline, serine, lysine, histidine and some of their peptides by the thermokinetic method,
European J. Mass Spectrometry, 2003, 9, 391-402. [all data]