6-Amino-3,5-dicyano-2,4-diphenyl-3,4-dihydro-2H-thiopyran-3-thiocarboxamide
- Formula: C20H16N4S2
- Molecular weight: 376.498
- CAS Registry Number: 73610-35-2

Reaction thermochemistry data

Data compiled by: Hussein Y. Afeefy, Joel F. Liebman, and Stephen E. Stein
Individual Reactions
By formula: C20H16N4S2 = 2C10H8N2S
Quantity | Value | Units | Method | Reference | Comment |
---|---|---|---|---|---|
ΔrH° | -80.5 | kJ/mol | Eqk | Brunskill, De, et al., 1980 | liquid phase; solvent: DMSO |

References

Brunskill, De, et al., 1980
Brunskill, J.S.A.; De, A.; Ewing, D.F.,
Substituent effects on reversible cycloaddition reaction,
J. Chem. Soc. Perkin Trans. 2, 1980, 4-7. [all data]