1-Butene, 2-ethyl-3-methyl-
- Formula: C7H14
- Molecular weight: 98.1861
- IUPAC Standard InChIKey: ADHCYQWFCLQBFG-UHFFFAOYSA-N
- CAS Registry Number: 7357-93-9
- Chemical structure:
View 3d structure (requires JavaScript / HTML 5) - Other names: 2-Ethyl-3-methylbut-1-ene; 3-Methyl-2-ethyl-1-butene; 2-Ethyl-3-methyl-1-butene

Condensed phase thermochemistry data

Data compiled by: Hussein Y. Afeefy, Joel F. Liebman, and Stephen E. Stein
Quantity | Value | Units | Method | Reference | Comment |
---|---|---|---|---|---|
ΔcH°liquid | -4641.3 ± 1.3 | kJ/mol | Ccb | Rockenfeller and Rossini, 1961 | Derived from the ratio of Heat of combustion; Corresponding ΔfHºliquid = -114.1 kJ/mol (simple calculation by NIST; no Washburn corrections) |

Phase change data

Data compiled as indicated in comments:
TRC - Thermodynamics Research Center, NIST Boulder Laboratories, Chris Muzny director
AC - William E. Acree, Jr., James S. Chickos
ALS - Hussein Y. Afeefy, Joel F. Liebman, and Stephen E. Stein
Quantity | Value | Units | Method | Reference | Comment |
---|---|---|---|---|---|
Tboil | 361. ± 4. | K | AVG | N/A | Average of 7 values; Individual data points |
Quantity | Value | Units | Method | Reference | Comment |
ΔvapH° | 34.3 | kJ/mol | N/A | Reid, 1972 | AC |
ΔvapH° | 34.4 | kJ/mol | V | Camin and Rossini, 1960 | ALS |
Enthalpy of vaporization
ΔvapH (kJ/mol) | Temperature (K) | Method | Reference | Comment |
---|---|---|---|---|
33.8 | 318. | A | Stephenson and Malanowski, 1987 | Based on data from 303. to 381. K.; AC |
34.4 | 305. | MM | Camin and Rossini, 1960, 2 | Based on data from 290. to 360. K.; AC |

Reaction thermochemistry data

Data compiled by: Hussein Y. Afeefy, Joel F. Liebman, and Stephen E. Stein
Individual Reactions
By formula: H2 + C7H14 = C7H16
Quantity | Value | Units | Method | Reference | Comment |
---|---|---|---|---|---|
ΔrH° | -114.0 ± 1.3 | kJ/mol | Chyd | Rogers and Dejroongruang, 1989 | liquid phase; solvent: Cyclohexane |

Kovats' RI, non-polar column, isothermal

Column type | Active phase | Temperature (C) | I | Reference | Comment |
---|---|---|---|---|---|
Capillary | Methyl Silicone | 30. | 665.8 | Soják, Addová, et al., 2002 | He; Column length: 150. m; Column diameter: 0.250 mm |
Capillary | Squalane | 30. | 658.3 | Soják, Addová, et al., 2002 | He; Column length: 93. m; Column diameter: 0.250 mm |
Capillary | DB-1 | 40. | 666. | Lubeck and Sutton, 1984 | 60. m/0.264 mm/0.25 μm, H2 |
Capillary | HP-PONA | 40. | 666. | Lubeck and Sutton, 1984 | 50. m/0.21 mm/0.5 μm, H2 |
Capillary | Squalane | 50. | 659. | Chretien and Dubois, 1976 | |
Capillary | Squalane | 50. | 659. | Rijks and Cramers, 1974 | N2; Column length: 100. m; Column diameter: 0.25 mm |
Capillary | Squalane | 70. | 660. | Rijks and Cramers, 1974 | N2; Column length: 100. m; Column diameter: 0.25 mm |
Capillary | Squalane | 40. | 662. | Matukuma, 1969 | N2; Column length: 91.4 m; Column diameter: 0.25 mm |
Packed | Squalane | 27. | 659. | Hively and Hinton, 1968 | He, Chromosorb P; Column length: 15. m; Column diameter: 0.25 mm |
Packed | Squalane | 49. | 660. | Hively and Hinton, 1968 | He, Chromosorb P; Column length: 15. m; Column diameter: 0.25 mm |
Packed | Squalane | 67. | 660. | Hively and Hinton, 1968 | He, Chromosorb P; Column length: 15. m; Column diameter: 0.25 mm |
Packed | Squalane | 86. | 661. | Hively and Hinton, 1968 | He, Chromosorb P; Column length: 15. m; Column diameter: 0.25 mm |

Kovats' RI, non-polar column, custom temperature program

Column type | Active phase | I | Reference | Comment |
---|---|---|---|---|
Capillary | Petrocol DH-100 | 662.7 | Haagen-Smit Laboratory, 1997 | He; Column length: 100. m; Column diameter: 0.2 mm; Program: 5C(10min) => 5C/min => 50C(48min) => 1.5C/min => 195C(91min) |

Van Den Dool and Kratz RI, non-polar column, temperature ramp

Column type | Active phase | I | Reference | Comment |
---|---|---|---|---|
Capillary | Methyl Silicone | 667.6 | Soják, Addová, et al., 2002 | He, 1. K/min; Column length: 150. m; Column diameter: 0.250 mm; Tstart: 30. C; Tend: 200. C |

Normal alkane RI, non-polar column, isothermal

Column type | Active phase | Temperature (C) | I | Reference | Comment |
---|---|---|---|---|---|
Capillary | Squalane | 40. | 658.6 | Sojak, Addova, et al., 2000 | He; Column length: 93. m; Column diameter: 0.25 mm |
Capillary | Methyl Silicone | 50. | 659. | N/A | N2; Column length: 74.6 m; Column diameter: 0.28 mm |
Capillary | Squalane | 70. | 658. | Schomburg, 1966 |

Normal alkane RI, non-polar column, temperature ramp

Column type | Active phase | I | Reference | Comment |
---|---|---|---|---|
Capillary | Petrocol DH | 655. | Supelco, 2012 | 100. m/0.25 mm/0.50 μm, Helium, 20. C @ 15. min, 15. K/min, 220. C @ 30. min |
Capillary | DB-1 | 652. | Ramnas, Ostermark, et al., 1994 | 50. m/0.32 mm/1.0 μm, He, 2. K/min; Tstart: -20. C |

References

Rockenfeller and Rossini, 1961
Rockenfeller, J.D.; Rossini, F.D.,
Heats of combustion, isomerization, and formation of selected C7, C8, and C10 monoolefin hydrocarbons,
J. Phys. Chem., 1961, 65, 267-272. [all data]
Reid, 1972
Reid, Robert C.,
Handbook on vapor pressure and heats of vaporization of hydrocarbons and related compounds, R. C. Wilhort and B. J. Zwolinski, Texas A Research Foundation. College Station, Texas(1971). 329 pages.$10.00,
AIChE J., 1972, 18, 6, 1278-1278, https://doi.org/10.1002/aic.690180637
. [all data]
Camin and Rossini, 1960
Camin, D.L.; Rossini, F.D.,
Physical properties of to selected C7 and C8 alkene hydrocarbons,
J. Chem. Eng. Data, 1960, 5, 368. [all data]
Stephenson and Malanowski, 1987
Stephenson, Richard M.; Malanowski, Stanislaw,
Handbook of the Thermodynamics of Organic Compounds, 1987, https://doi.org/10.1007/978-94-009-3173-2
. [all data]
Camin and Rossini, 1960, 2
Camin, D.L.; Rossini, F.D.,
Physical Properties of 16 Selected C 7 and C 8 Alkene Hydrocarbons.,
J. Chem. Eng. Data, 1960, 5, 3, 368-372, https://doi.org/10.1021/je60007a037
. [all data]
Rogers and Dejroongruang, 1989
Rogers, D.W.; Dejroongruang, K.,
Enthalpies of hydrogenation of the dimethylpentenes, ethylpentenes, methylbutene, and trimethylbutene,
J. Chem. Thermodyn., 1989, 21, 1115-1120. [all data]
Soják, Addová, et al., 2002
Soják, L.; Addová, G.; Kubinec, R.; Kraus, A.; Hu, G.,
Gas chromatographic-mass spectrometric characterization of all acyclic C5-C7 alkenes from fluid catalytic cracked gasoline using polydimethylsiloxane and squalane stationary phases,
J. Chromatogr. A, 2002, 947, 1, 103-117, https://doi.org/10.1016/S0021-9673(01)01564-3
. [all data]
Lubeck and Sutton, 1984
Lubeck, A.J.; Sutton, D.L.,
Kovats Retention Indices of Selected Olefins on Bonded Phase Fused Silica Capillaries,
J. Hi. Res. Chromatogr. Chromatogr. Comm., 1984, 7, 9, 542-544, https://doi.org/10.1002/jhrc.1240070913
. [all data]
Chretien and Dubois, 1976
Chretien, J.R.; Dubois, J.-E.,
New Perspectives in the Prediction of Kovats Indices,
J. Chromatogr., 1976, 126, 171-189, https://doi.org/10.1016/S0021-9673(01)84071-1
. [all data]
Rijks and Cramers, 1974
Rijks, J.A.; Cramers, C.A.,
High precision capillary gas chromatography of hydrocarbons,
Chromatographia, 1974, 7, 3, 99-106, https://doi.org/10.1007/BF02269819
. [all data]
Matukuma, 1969
Matukuma, A.,
Retention indices of alkanes through C10 and alkenes through C8 and relation between boiling points and retention data,
Gas Chromatogr., Int. Symp. Anal. Instrum. Div Instrum Soc. Amer., 1969, 7, 55-75. [all data]
Hively and Hinton, 1968
Hively, R.A.; Hinton, R.E.,
Variation of the retention index with temperature on squalane substrates,
J. Gas Chromatogr., 1968, 6, 4, 203-217, https://doi.org/10.1093/chromsci/6.4.203
. [all data]
Haagen-Smit Laboratory, 1997
Haagen-Smit Laboratory,
Procedure for the detailed hydrocarbon analysis of gasolines by single column high efficiency (capillary) column gas chromatography, SOP NO. MLD 118, Revision No. 1.1, California Environmental Protection Agency, Air Resources Board, El Monte, California, 1997, 22. [all data]
Sojak, Addova, et al., 2000
Sojak, L.; Addova, G.; Kubinec, R.; Ruman, J.; Hu, G.,
GC-MS characterization of all acyclic C5-C7 alkenes from FCC gasoline using squalane stationary phase,
Petroleum and Coal, 2000, 42, 3-4, 188-194. [all data]
Schomburg, 1966
Schomburg, G.,
Gaschromatographische Retentionsdaten und Struktur Chemischer Verbindungen. II. Methylverzweigungen und Doppelbindungen in Offenkettigen Kohlenwasserstoffen,
J. Chromatogr., 1966, 23, 1-17, https://doi.org/10.1016/S0021-9673(01)98652-2
. [all data]
Supelco, 2012
Supelco, CatalogNo. 24160-U,
Petrocol DH Columns. Catalog No. 24160-U, 2012, retrieved from http://www.sigmaaldrich.com/etc/medialib/docs/Supelco/Datasheet/1/w97949.Par.0001.File.tmp/w97949.pdf. [all data]
Ramnas, Ostermark, et al., 1994
Ramnas, O.; Ostermark, U.; Peterson, G.,
Characterization of sixty alkenes in a cat-cracked gasoline naphtha by gas chromatography,
Chromatographia, 1994, 38, 3/4, 222-226, https://doi.org/10.1007/BF02290340
. [all data]