Perylene, 3-hexyl-
- Formula: C26H24
- Molecular weight: 336.4688
- IUPAC Standard InChIKey: TZZMLMCAAVPEBH-UHFFFAOYSA-N
- CAS Registry Number: 7350-91-6
- Chemical structure:
View 3d structure (requires JavaScript / HTML 5) - Other names: 3-n-Hexylperylene; 3-Hexylperylene

Phase change data

Data compiled by: Thermodynamics Research Center, NIST Boulder Laboratories, Chris Muzny director
Quantity | Value | Units | Method | Reference | Comment |
---|---|---|---|---|---|
Tfus | 414.65 | K | N/A | Anonymous, 1968 | Uncertainty assigned by TRC = 0.5 K |

References

Anonymous, 1968
Anonymous, R.,
Properties of hydrocarbon of high molecular weight, Am. Pet. Inst. Res. Proj. 42, Penn. State Univ., 1968. [all data]