(E)-1-bromo-2-pentene
- Formula: C5H9Br
- Molecular weight: 149.029
- IUPAC Standard InChIKey: FTBPZRNURKMEFD-ONEGZZNKSA-N
- CAS Registry Number: 7348-71-2
- Chemical structure:
View 3d structure (requires JavaScript / HTML 5) - Species with the same structure:
- Stereoisomers:

Phase change data

Data compiled by: Thermodynamics Research Center, NIST Boulder Laboratories, Chris Muzny director
Quantity | Value | Units | Method | Reference | Comment |
---|---|---|---|---|---|
Tboil | 397. | K | N/A | Bouis, 1927 | Uncertainty assigned by TRC = 4. K; geometric isomer not identified |

References

Bouis, 1927
Bouis, M.,
Synthesis of Allene Hydrocarbons,
Bull. Soc. Chim. Fr., 1927, 41, 1160-5. [all data]