5α-Androstan-3α-ol-17-one, TMS derivative
- Formula: C22H38O2Si
- Molecular weight: 362.6214
- IUPAC Standard InChIKey: RKALSSDGCWGKHQ-VENWGGTKSA-N
- CAS Registry Number: 7337-91-9
- Chemical structure:
View 3d structure (requires JavaScript / HTML 5) - Stereoisomers:
- Other names: Androstan-17-one, 3-[(trimethylsilyl)oxy]-, (3α,5α)-; 5α-Androstan-17-one, 3α-(trimethylsiloxy)-; 3-[(Trimethylsilyl)oxy]androstan-17-one-, (3α,5α)-; 5α-Androstan-3α-ol-17-one, TMS; Androsterone, TMS; Androsterone, TMSi (3-O); Androsterone, trimethylsilyl ether; Androsterone, 3-[(trimethylsilyl)oxy]-

Kovats' RI, non-polar column, isothermal

Column type | Active phase | Temperature (C) | I | Reference | Comment |
---|---|---|---|---|---|
Packed | OV-1 | 230. | 2485. | Quilliam and Westmore, 1978 | Gas Chrom Q; Column length: 1. m |
Packed | OV-1 | 225. | 2458. | Voelter, Jung, et al., 1971 | N2, GasChrom Q |

Van Den Dool and Kratz RI, non-polar column, temperature ramp

Column type | Active phase | I | Reference | Comment |
---|---|---|---|---|
Capillary | DB-1 | 2505. | Ludwig-Koehn and Henning, 1986 | 30. m/0.25 mm/0.25 μm, H2, 2. K/min; Tstart: 120. C; Tend: 280. C |

Normal alkane RI, non-polar column, isothermal

Column type | Active phase | Temperature (C) | I | Reference | Comment |
---|---|---|---|---|---|
Capillary | OV-101 | 240. | 2499. | Krupcik, Rutten, et al., 1976 | Column length: 30. m; Column diameter: 0.25 mm |
Capillary | OV-101 | 251. | 2515. | Krupcik, Rutten, et al., 1976 | Column length: 30. m; Column diameter: 0.25 mm |

Normal alkane RI, non-polar column, custom temperature program

Column type | Active phase | I | Reference | Comment |
---|---|---|---|---|
Capillary | Methyl Silicone | 2452. | Meng and Sjövall, 1997 | 25. m/0.32 mm/0.25 μm; Program: 60 0C 30 K/min -> 210 0C (1.5 min) 2.5 K/min -> 320 0C (20 min) |

References

Quilliam and Westmore, 1978
Quilliam, M.A.; Westmore, J.B.,
Sterically crowded trialkylsilyl derivatives for chromatography and mass spectrometry of biologically-important compounds,
Anal. Chem., 1978, 50, 1, 59-68, https://doi.org/10.1021/ac50023a020
. [all data]
Voelter, Jung, et al., 1971
Voelter, W.; Jung, G.; Breitmaier, E.; Bouchon, G.; Bayer, E.; Gupta, D.,
Comparison of the trifluoroacetyl and trimethylsilylether derivaties for gas chromatography of steroids,
Anal. Chim. Acta., 1971, 53, 1, 185-188, https://doi.org/10.1016/S0003-2670(01)80085-4
. [all data]
Ludwig-Koehn and Henning, 1986
Ludwig-Koehn, H.; Henning, H.V.,
Some aspects of quantification of neutral steroid metabolites in body fluids of healthy and uremic subjects by capillary gas chromatography,
J. Hi. Res. Chromatogr. Chromatogr. Comm., 1986, 9, 1, 35-38, https://doi.org/10.1002/jhrc.1240090106
. [all data]
Krupcik, Rutten, et al., 1976
Krupcik, J.; Rutten, G.A.F.M.; Rijks, J.A.,
The influence of temperature on the separation and characterization of steroids on non-polar glass capillary columns,
Chem. zvesti, 1976, 30, 4, 469-479. [all data]
Meng and Sjövall, 1997
Meng, L.-J.; Sjövall, J.,
Method for combined analysis of profiles of conjugated progesterone metabolites and bile acids in serum and urine of pregnant women,
J. Chromatogr. B, 1997, 688, 1, 11-26, https://doi.org/10.1016/S0378-4347(97)88051-6
. [all data]