(Z)-Pinocarvyl acetate
- Formula: C12H18O2
- Molecular weight: 194.2701
- IUPAC Standard InChIKey: UDBAGFUFASPUFS-OUAUKWLOSA-N
- CAS Registry Number: 73366-18-4
- Chemical structure:
View 3d structure (requires JavaScript / HTML 5) - Stereoisomers:

Normal alkane RI, non-polar column, custom temperature program

Column type | Active phase | I | Reference | Comment |
---|---|---|---|---|
Capillary | BPX-5 | 1258. | Salamci, Kordali, et al., 2007 | 30. m/0.25 mm/0.25 μm, He; Program: 50C => 3C/min => 150C(10min) => 10C/min => 250C |

References

Salamci, Kordali, et al., 2007
Salamci, E.; Kordali, S.; Kotan, R.; Cakir, A.; Kaya, Y.,
Chemical compositions, antimicrobial and herbicidal effects of essential oils isolated from Turkish Tanacetum aucheranum and Tanacetum chiliophyllum var. chiliophyllum,
Biochem. Syst. Ecol., 2007, 35, 9, 569-581, https://doi.org/10.1016/j.bse.2007.03.012
. [all data]