Di-epi-1,10-cubenol
- Formula: C15H26O
- Molecular weight: 222.3663
- IUPAC Standard InChIKey: COGPRPSWSKLKTF-UHFFFAOYSA-N
- CAS Registry Number: 73365-77-2
- Chemical structure:
View 3d structure (requires JavaScript / HTML 5) - Species with the same structure:
- Stereoisomers:
- Other names: (1S,4S,4aS,8aR)-1-Isopropyl-4,7-dimethyl-1,3,4,5,6,8a-hexahydronaphthalen-4a(2H)-ol; 4a(2H)-Naphthalenol, 1,3,4,5,6,8a-hexahydro-4,7-dimethyl-1-(1-methylethyl)-, (1S,4S,4aS,8aR)-; 4a(2H)-Naphthalenol, 1,3,4,5,6,8a-hexahydro-4,7-dimethyl-1-(1-methylethyl)-, [1S-(1α,4α,4aα,8aα)]-; 1,10-Di-epi-Cubenol; 1-10-epi-Cubenol; Cubenol (1,10 di-epi); Cubenol (1,10 di-epi-); diepi-Cubenol

Kovats' RI, non-polar column, temperature ramp

Column type | Active phase | I | Reference | Comment |
---|---|---|---|---|
Capillary | DB-5 | 1618. | Adams and Nguyen, 2005 | 30. m/0.26 mm/0.25 μm, He, 3. K/min; Tstart: 60. C; Tend: 246. C |
Capillary | HP-5MS | 1623. | Baranauskiene, Venskutonis, et al., 2003 | 30. m/0.25 mm/0.25 μm, He, 50. C @ 2. min, 4. K/min, 280. C @ 10. min |
Capillary | DB-5 | 1591. | Marongiu, Piras, et al., 2003 | 30. m/0.25 mm/0.25 μm, He, 3. K/min, 240. C @ 30. min; Tstart: 60. C |
Capillary | DB-5 | 1589. | Marongiu, Piras, et al., 2003 | 30. m/0.25 mm/0.25 μm, He, 3. K/min, 240. C @ 30. min; Tstart: 60. C |
Capillary | SE-30 | 1590. | Kardali, Velasco-Negueruela, et al., 2000 | 25. m/0.22 mm/0.25 μm, He, 5. K/min; Tstart: 70. C; Tend: 220. C |

Kovats' RI, non-polar column, custom temperature program

Column type | Active phase | I | Reference | Comment |
---|---|---|---|---|
Capillary | HP-5 | 1613. | Sibanda, Chigwada, et al., 2004 | 30. m/0.25 mm/0.25 μm, He; Program: 40C(10min) => 3C/min => 200C => 2C/min => 220C |
Capillary | HP-5 | 1613. | Frizzo, Serafini, et al., 2001 | 30. m/0.32 mm/0.25 μm, H2; Program: 60 0C (8 min) 3 K/min -> 180 0C 20 K/min (20 min) |

Van Den Dool and Kratz RI, non-polar column, temperature ramp

Column type | Active phase | I | Reference | Comment |
---|---|---|---|---|
Capillary | DB-5 | 1616. | Maccioni, Baldini, et al., 2007 | 30. m/0.25 mm/0.25 μm, He, 3. K/min; Tstart: 60. C; Tend: 240. C |
Capillary | DB-5 | 1612. | Martins, Santos, et al., 2007 | 30. m/0.22 mm/0.25 μm, 60. C @ 2. min, 3. K/min; Tend: 240. C |
Capillary | Methyl Silicone | 1607. | Melo, Corrêa, et al., 2007 | 30. m/0.25 mm/0.25 μm, He, 2. K/min, 220. C @ 15. min; Tstart: 80. C |
Capillary | ZB-5 | 1612. | Simoniatto, Bonani, et al., 2007 | 30. m/0.25 mm/0.25 μm, He, 3. K/min; Tstart: 50. C; Tend: 250. C |
Capillary | DB-5 | 1602. | Pavlovic, Tzakou, et al., 2006 | 30. m/0.32 mm/0.25 μm, He, 3. K/min; Tstart: 60. C; Tend: 280. C |
Capillary | DB-5 | 1619. | Su, Ho, et al., 2006 | 30. m/0.25 mm/0.25 μm, He, 50. C @ 2. min, 5. K/min; Tend: 250. C |
Capillary | RTX-1 | 1610. | Paolini, Costa, et al., 2005 | 60. m/0.22 mm/0.25 μm, He, 2. K/min, 230. C @ 35. min; Tstart: 60. C |
Capillary | RTX-5 | 1617. | Dugo, Mondello, et al., 2004 | 30. m/0.25 mm/0.25 μm, He, 45. C @ 6. min, 3. K/min, 300. C @ 10. min |
Capillary | HP-5 | 1614. | Flamini, Luigi Cioni, et al., 2004 | 30. m/0.25 mm/0.25 μm, N2, 60. C @ 10. min, 5. K/min; Tend: 220. C |
Capillary | HP-5 | 1617. | Javidnia, Miri, et al., 2004 | 30. m/0.25 mm/0.25 μm, He, 3. K/min; Tstart: 60. C; Tend: 260. C |
Capillary | HP-5MS | 1614. | Demetzos, Angelopoulou, et al., 2002 | 30. m/0.25 mm/0.25 μm, 50. C @ 5. min, 3. K/min; Tend: 280. C |
Capillary | DB-5 | 1614. | Miri, Ramezani, et al., 2002 | He, 4. K/min; Column length: 25. m; Column diameter: 0.25 mm; Tstart: 70. C; Tend: 260. C |
Capillary | HP-5 | 1607. | Couladis, Tsortanidou, et al., 2001 | 30. m/0.25 mm/0.25 μm, He, 3. K/min; Tstart: 60. C; Tend: 380. C |
Capillary | HP-5 | 1616. | Skaltsa, Lazari, et al., 2000 | 30. m/0.25 mm/0.25 μm, He, 50. C @ 5. min, 4. K/min; Tend: 280. C |
Capillary | OV-1 | 1599. | Bicchi, Rubiolo, et al., 1998 | 25. m/0.25 mm/0.3 μm, 50. C @ 1. min, 3. K/min, 200. C @ 20. min |

Van Den Dool and Kratz RI, non-polar column, custom temperature program

Column type | Active phase | I | Reference | Comment |
---|---|---|---|---|
Capillary | HP-5MS | 1636.2 | Andriamaharavo, 2014 | 30. m/0.25 mm/0.25 μm, He; Program: 60C (1 min) => 5 C/min => 210C => 10 C/min => 280C (15 min) |
Capillary | SE-52 | 1618. | Bruni, Pellati, et al., 2005 | 30. m/0.32 mm/0.15 μm, He; Program: 45C => 1C/min => 100C => 5C/min => 250C(10min) |
Capillary | CBP-5 | 1612. | Oliveira, Campos, et al., 2005 | 30. m/0.25 mm/0.25 μm, He; Program: 60C => 3C/min => 240C => 10C/min => 280C(10min) |
Capillary | SE-52 | 1618. | Sacchetti, Medici, et al., 2004 | 30. m/0.52 mm/0.15 μm, He; Program: 45C => 1C/min => 100C => 5C/min => 250C (10min) |
Capillary | CBP-5 | 1612. | Azevedo, Campos, et al., 2002 | 50. m/0.25 mm/0.25 μm, He; Program: 60C(2min) => 3C/min => 240C => 10C/min => 280C(10min) |

Van Den Dool and Kratz RI, polar column, temperature ramp

Column type | Active phase | I | Reference | Comment |
---|---|---|---|---|
Capillary | RTX-Wax | 2054. | Paolini, Costa, et al., 2005 | 60. m/0.22 mm/0.25 μm, He, 2. K/min, 230. C @ 35. min; Tstart: 60. C |

Normal alkane RI, non-polar column, temperature ramp

Column type | Active phase | I | Reference | Comment |
---|---|---|---|---|
Capillary | HP-5 | 1623. | Radulovic, Dordevic, et al., 2010 | 30. m/0.25 mm/0.25 μm, Hydrogen, 5. K/min; Tstart: 70. C; Tend: 290. C |
Capillary | 5 % Phenyl methyl siloxane | 1618. | Retta, Gattuso, et al., 2009 | 60. m/0.25 mm/0.25 μm, Helium, 3. K/min, 225. C @ 3. min; Tstart: 90. C |
Capillary | DB-5 MS | 1610. | Noudogbessi, Yedomonhan, et al., 2008 | 30. m/0.25 mm/0.25 μm, Helium, 50. C @ 5. min, 5. K/min, 300. C @ 5. min |
Capillary | RTX-1 | 1610. | Paolini, Tomi, et al., 2008 | 60. m/0.22 mm/0.25 μm, He, 2. K/min, 230. C @ 35. min; Tstart: 60. C |
Capillary | Elite-1 | 1625. | Raj, Baby, et al., 2008 | 30. m/0.32 mm/0.25 μm, Helium, 3. K/min; Tstart: 60. C; Tend: 246. C |
Capillary | DB-5 | 1614. | Bos, Woerdenbag, et al., 2007 | 30. m/0.26 mm/0.25 μm, He, 3. K/min; Tstart: 60. C; Tend: 240. C |
Capillary | DB-5 | 1614. | Elfami, Bos, et al., 2007 | 30. m/0.26 mm/0.25 μm, Helium, 3. K/min; Tstart: 60. C; Tend: 290. C |
Capillary | Col-Elite 5MS | 1630. | Gudaityte and Venskutonis R.P., 2007 | 30. m/0.25 mm/0.25 μm, He, 3. K/min; Tstart: 30. C; Tend: 246. C |
Capillary | DB-5 | 1593. | Moreno, Lima, et al., 2007 | 30. m/0.25 mm/0.25 μm, Helium, 3. K/min; Tstart: 60. C; Tend: 300. C |
Capillary | HP-5 MS | 1619. | Rojas, Velasco, et al., 2007 | 60. m/0.25 mm/0.25 μm, Hydrogen, 4. K/min, 260. C @ 20. min; Tstart: 60. C |
Capillary | DB-5 | 1633. | Smelcerovic, Spiteller, et al., 2007 | 30. m/0.25 mm/0.25 μm, He, 10. K/min, 320. C @ 4. min; Tstart: 60. C |
Capillary | DB-5 | 1596. | Apel, Sobral, et al., 2006 | 30. m/0.25 mm/0.25 μm, He, 3. K/min; Tstart: 60. C; Tend: 300. C |
Capillary | DB-5 | 1606. | Apel, Sobral, et al., 2006, 2 | 30. m/0.25 mm/0.25 μm, 3. K/min; Tstart: 60. C; Tend: 300. C |
Capillary | DB-5 | 1614. | Elfami, Komar, et al., 2006 | 30. m/0.26 mm/0.25 μm, Helium, 3. K/min; Tstart: 60. C; Tend: 290. C |
Capillary | HP-5 | 1614. | Figuérédo, Cabassu, et al., 2006 | 30. m/0.25 mm/0.25 μm, He, 50. C @ 5. min, 5. K/min, 300. C @ 5. min |
Capillary | DB-5 | 1608. | Garneau F.X., Collin G., et al., 2006 | 30. m/0.25 mm/0.25 μm, 40. C @ 2. min, 2. K/min, 210. C @ 33. min |
Capillary | DB-5 | 1621. | Morteza-Semnani K., Saeedi M., et al., 2006 | 30. m/0.25 mm/0.25 μm, He, 60. C @ 5. min, 4. K/min; Tend: 220. C |
Capillary | DB-5 | 1607. | Ouamba, Ouabonzi, et al., 2006 | 25. m/0.25 mm/0.15 μm, N2, 50. C @ 3. min, 4. K/min; Tend: 200. C |
Capillary | DB-1 | 1613. | Pala-Paul J., Perez-Alonso M.J., et al., 2006 | 50. m/0.25 mm/0.25 μm, N2, 4. K/min; Tstart: 95. C; Tend: 240. C |
Capillary | HP-5MS | 1605. | Sabulal, Dan, et al., 2006 | 30. m/0.32 mm/0.25 μm, He, 3. K/min; Tstart: 60. C; Tend: 243. C |
Capillary | HP-5MS | 1616. | Sajjadi, 2006 | 30. m/0.25 mm/0.25 μm, He, 4. K/min; Tstart: 60. C; Tend: 280. C |
Capillary | HP-5 MS | 1605. | Tigrine-Kordiani, Meklati, et al., 2006 | 30. m/0.25 mm/0.25 μm, Helium, 60. C @ 8. min, 2. K/min, 250. C @ 15. min |
Capillary | DB-5 | 1614. | Chagonda and Chalchat, 2005 | 25. m/0.25 mm/0.15 μm, 40. C @ 5. min, 3. K/min; Tend: 220. C |
Capillary | HP-5 | 1614. | Figuérédo, Cabassu, et al., 2005 | 30. m/0.25 mm/0.25 μm, He, 50. C @ 5. min, 5. K/min, 300. C @ 5. min |
Capillary | HP-5MS | 1614. | Ghasemi Y., Faridi P., et al., 2005 | He, 50. C @ 3. min, 3. K/min, 250. C @ 10. min; Column length: 25. m; Column diameter: 0.25 mm |
Capillary | DB-1 | 1611. | Pala-Paul, Perez-Alonso, et al., 2005 | 50. m/0.25 mm/0.25 μm, N2, 4. K/min; Tstart: 95. C; Tend: 240. C |
Capillary | DB-5 | 1613. | Salehi, Sefidkon, et al., 2005 | 30. m/0.25 mm/0.25 μm, He, 60. C @ 4. min, 3. K/min; Tend: 220. C |
Capillary | HP-5MS | 1618. | Setzer, Noletto, et al., 2005 | 30. m/0.25 mm/0.25 μm, He, 60. C @ 5. min, 3. K/min; Tend: 280. C |
Capillary | HP-5MS | 1616. | Slavkovska, Couladis, et al., 2005 | 30. m/0.25 mm/0.25 μm, He, 3. K/min; Tstart: 60. C; Tend: 280. C |
Capillary | DB-5 | 1592. | Tzakou and Constantinidis, 2005 | 30. m/0.32 mm/0.25 μm, He, 3. K/min; Tstart: 60. C; Tend: 280. C |
Capillary | CP Sil 5 CB | 1609. | Agnaniet, Menut, et al., 2004 | 30. m/0.25 mm/0.25 μm, N2, 5. K/min; Tstart: 50. C; Tend: 200. C |
Capillary | DB-5 | 1605. | Limberger, Sobral, et al., 2004 | 30. m/0.25 mm/0.25 μm, He, 3. K/min; Tstart: 60. C; Tend: 300. C |
Capillary | DB-5MS | 1587. | Marongiu, Porcedda, et al., 2004 | 30. m/0.25 mm/0.25 μm, He, 3. K/min, 280. C @ 30. min; Tstart: 60. C |
Capillary | HP-5MS | 1623. | Feizbaksh, Saber Tehrani, et al., 2003 | 30. m/0.25 mm/0.25 μm, He, 60. C @ 20. min, 5. K/min, 220. C @ 20. min |
Capillary | DB-1 | 1611. | Fekam Boyom, Ngouana, et al., 2003 | 30. m/0.25 mm/0.25 μm, N2, 5. K/min; Tstart: 50. C; Tend: 200. C |
Capillary | HP-5MS | 1614. | Ghasemi, Asghari, et al., 2003 | 30. m/0.25 mm/0.25 μm, He, 4. K/min; Tstart: 60. C; Tend: 280. C |
Capillary | DB-5 | 1610. | Limberger, Simões-Pires, et al., 2003 | 30. m/0.25 mm/0.25 μm, He, 3. K/min; Tstart: 60. C; Tend: 250. C |
Capillary | DB-5 | 1614. | Pino, Marbot, et al., 2003 | 30. m/0.25 mm/0.25 μm, H2, 60. C @ 10. min, 4. K/min, 280. C @ 40. min |
Capillary | DB-5 | 1614. | Pino, Marbot, et al., 2003 | 30. m/0.25 mm/0.25 μm, H2, 60. C @ 10. min, 4. K/min, 280. C @ 40. min |
Capillary | HP-5 | 1592. | Pitarokili, Tzakou, et al., 2003 | 30. m/0.25 mm/0.25 μm, He, 3. K/min; Tstart: 60. C; Tend: 280. C |
Capillary | SE-30 | 1600. | Iñigo, Palá-Paúl, et al., 2002 | 50. m/0.25 mm/0.25 μm, He, 4. K/min; Tstart: 70. C; Tend: 240. C |
Capillary | DB-5 | 1615. | Kabouss, Charrouf, et al., 2002 | 30. m/0.25 mm/0.25 μm, 40. C @ 2. min, 2. K/min, 210. C @ 33. min |
Capillary | DB-5 | 1611. | Limberger, Simões-Pires, et al., 2002 | 30. m/0.25 mm/0.25 μm, He, 3. K/min; Tstart: 60. C; Tend: 250. C |
Capillary | DB-5MS | 1614. | Maia, Zoghbi, et al., 2002 | 30. m/0.25 mm/0.25 μm, He, 3. K/min; Tstart: 60. C; Tend: 240. C |
Capillary | CP Sil 5 CB | 1607. | Monfared, Davarani, et al., 2002 | He, 5. K/min; Column length: 25. m; Column diameter: 0.25 mm; Tstart: 60. C; Tend: 220. C |
Capillary | DB-1 | 1579. | Velasco-Negueruela, Pérez-Alonso, et al., 2002 | 50. m/0.25 mm/0.25 μm, N2, 3. K/min; Tstart: 60. C; Tend: 240. C |
Capillary | DB-5MS | 1615. | Zoghbi, Andrade, et al., 2002 | 30. m/0.25 mm/0.25 μm, He, 3. K/min; Tstart: 60. C; Tend: 270. C |
Capillary | DB-1 | 1609.0 | Santos, Moreira, et al., 2001 | He, 3. K/min; Column length: 30. m; Column diameter: 0.2 mm; Tstart: 60. C; Tend: 240. C |

Normal alkane RI, non-polar column, custom temperature program

Column type | Active phase | I | Reference | Comment |
---|---|---|---|---|
Capillary | DB-5 | 1608. | Gazim, Rezende, et al., 2008 | 30. m/0.25 mm/0.25 μm, Helium; Program: 35 0C 1 0C/min -> 60 0C 3 0C/min -> 170 0C 8 0C/min -> 200 0C 15 0C/min -> 280 0C (5 min) |
Capillary | DB-5 | 1614. | Gazim, Rezende, et al., 2008 | 30. m/0.25 mm/0.25 μm, Helium; Program: not specified |
Capillary | CP Sil 8 CB | 1619. | Kupcinskiene, Stikliene, et al., 2008 | 50. m/0.32 mm/0.25 μm, Helium; Program: not specified |
Capillary | Elite-1 | 1619. | Raj, Baby, et al., 2008 | 30. m/0.32 mm/0.25 μm, Helium; Program: not specified |
Capillary | DB-5 | 1621. | Santos, Costa, et al., 2008 | Helium; Column length: 30. m; Column diameter: 0.25 mm; Program: 80 0C (2 min) 3 0C/min -> 180 0C 10 0C/min -> 300 0C (10 min) |
Capillary | DB-5 | 1619. | Santos, Costa, et al., 2008 | Helium; Column length: 30. m; Column diameter: 0.25 mm; Program: not specified |
Capillary | HP-5MS | 1612. | Cole, Haber, et al., 2007 | 30. m/0.25 mm/0.25 μm, He; Program: 40C(10min) => 3C/min => 200C => 2C/min => 220C |
Capillary | HP-5 MS | 1613. | Moriarity, Bansal, et al., 2007 | 30. m/0.25 mm/0.25 μm, Helium; Program: 40 0C (10 min) 3 0C/min -> 200 0C 2 0C/min -> 220 0C |
Capillary | HP-5 MS | 1612. | Stokes, Cole, et al., 2007 | Program: not specified |
Capillary | HP-5MS | 1617. | Takaku, Haber, et al., 2007 | He; Column length: 30. m; Column diameter: 0.25 mm; Program: 40C(10min) => 3C/min => 200C => 2C/min => 220C |
Capillary | Polydimethyl siloxane | 1619. | Werka, Boehme, et al., 2007 | Program: not specified |
Capillary | HP-5 MS | 1614. | Schmidt, Noletto, et al., 2006 | 30. m/0.25 mm/0.25 μm, Helium; Program: 40 0C (10 min) 3 0C/min -> 200 0C 2 0C/min -> 220 0C |
Capillary | SE-52 | 1619. | Tognolini, Barocelli, et al., 2006 | 30. m/0.32 mm/0.15 μm, He; Program: 45C => 1C/min => 100C => 5C/min => 250C (10min) |
Capillary | CP Sil 8 CB | 1616. | Butkienë, Nivinskienë, et al., 2005 | 50. m/0.32 mm/0.25 μm, He; Program: 50C(5min) => 2C/min => 90C => 15C/min => 240C(4min) |
Capillary | DB-5 | 1612. | de Menezes, Lemos, et al., 2005 | 30. m/0.25 mm/0.25 μm, He; Program: 35C => 4C/min => 180C => 10C/min => 250C |
Capillary | CP Sil 8 CB | 1616. | Butkienë, Nivinskienë, et al., 2004 | 50. m/0.32 mm/0.25 μm, He; Program: 50C(5min) => 2C/min => 90C => 15C/min => 240C(4min) |
Capillary | OV-1 | 1592. | El-Shazly and Hussein, 2004 | He; Column length: 15. m; Column diameter: 0.317 mm; Program: 50C(4min) => 4C/min => 90C => 10C/min => 300C(10min) |
Capillary | CP Sil 8 CB | 1614. | Mockute, Nivinskiene, et al., 2003 | 50. m/0.32 mm/0.25 μm, He; Program: 60C(1min) => 5C/min => 160C => 10C/min => 250C(5min) |
Capillary | DB-5 | 1610. | Ferreira, Costantin, et al., 2001 | Program: not specified |
Capillary | CP Sil 5 CB | 1614. | Weyerstahl, Marschall, et al., 1998 | N2; Column length: 25. m; Phase thickness: 0.39 μm; Program: not specified |
Capillary | CP Sil 5 CB | 1605. | Weyerstahl, Marschall, et al., 1998, 2 | N2; Column length: 25. m; Program: not specified |

Normal alkane RI, polar column, temperature ramp

Column type | Active phase | I | Reference | Comment |
---|---|---|---|---|
Capillary | RTX-Wax | 2054. | Paolini, Tomi, et al., 2008 | 60. m/0.22 mm/0.25 μm, He, 2. K/min, 230. C @ 35. min; Tstart: 60. C |
Capillary | TC-FFAP | 2057. | Kurose, Okamura, et al., 2007 | He, 3. K/min, 220. C @ 30. min; Column diameter: 0.25 mm; Phase thickness: 0.25 μm; Tstart: 60. C |
Capillary | Supelcowax-10 | 2054. | Garneau F.X., Collin G., et al., 2006 | 30. m/0.25 mm/0.25 μm, 40. C @ 2. min, 2. K/min, 210. C @ 33. min |
Capillary | Carbowax-PEG | 2037. | Tigrine-Kordiani, Meklati, et al., 2006 | 60. m/0.20 mm/0.25 μm, Helium, 60. C @ 8. min, 2. K/min, 250. C @ 15. min |
Capillary | Supelcowax-10 | 2022. | Kabouss, Charrouf, et al., 2002 | 30. m/0.25 mm/0.25 μm, 40. C @ 2. min, 2. K/min, 210. C @ 33. min |
Capillary | DB-Wax | 2056. | Paniandy, Chane-Ming, et al., 2000 | 60. m/0.32 mm/0.25 μm, Helium, 50. C @ 2. min, 5. K/min; Tend: 230. C |

Normal alkane RI, polar column, custom temperature program

Column type | Active phase | I | Reference | Comment |
---|---|---|---|---|
Capillary | DB-Wax | 2037. | Paniandy, Chane-Ming, et al., 2000 | 60. m/0.32 mm/0.25 μm, Helium; Program: not specified |
Capillary | DB-Wax | 2074. | Weyerstahl, Marschall, et al., 1998 | N2; Column length: 60. m; Phase thickness: 0.25 μm; Program: not specified |

References

Adams and Nguyen, 2005
Adams, R.P.; Nguyen, S.,
Infra-specific variation in Juniperus deppeana and F. Sperryi in the Davis Mountains of Texas: variation in leaf essential oils and random amplified polymorphic DNAS (RAPDS),
Phytologia, 2005, 87, 2, 96-108. [all data]
Baranauskiene, Venskutonis, et al., 2003
Baranauskiene, R.; Venskutonis, P.R.; Viskelis, P.; Dambrauskiene, E.,
Influence of nitrogen fertilizers on the yield and composition of thyme (Thymus vulgaris),
J. Agric. Food Chem., 2003, 51, 26, 7751-7758, https://doi.org/10.1021/jf0303316
. [all data]
Marongiu, Piras, et al., 2003
Marongiu, B.; Piras, A.; Pani, F.; Porcedda, S.; Ballero, M.,
Extraction, separation and isolation of essential oils from natural matrices by supercritical CO2,
Flavour Fragr. J., 2003, 18, 6, 505-509, https://doi.org/10.1002/ffj.1258
. [all data]
Kardali, Velasco-Negueruela, et al., 2000
Kardali, M.; Velasco-Negueruela, A.; Pérez-Alonso, M.,
Essential Oil Constituents of Sideritis ibanyezii Pau,
Botanica Complutensis, 2000, 24, 101-106. [all data]
Sibanda, Chigwada, et al., 2004
Sibanda, S.; Chigwada, G.; Poole, M.; Gwebu, E.T.; Noletto, J.A.; Schmidt, J.M.; Rea, A.I.; Setzer, W.N.,
Composition and bioactivity of the leaf essential oil of Heteropyxis dehniae from Zimbabwe,
J. Ethnopharmacol., 2004, 92, 1, 107-111, https://doi.org/10.1016/j.jep.2004.02.010
. [all data]
Frizzo, Serafini, et al., 2001
Frizzo, C.D.; Serafini, L.A.; Dellacassa, E.; Lorenzo, D.; Moyna, P.,
Essential oil of Baccharis uncinella DC. from Southern Brazil,
Flavour Fragr. J., 2001, 16, 4, 286-288, https://doi.org/10.1002/ffj.998
. [all data]
Maccioni, Baldini, et al., 2007
Maccioni, S.; Baldini, R.; Luigi Cioni, P.; Tebano, M.; Flamini, G.,
In vivo volatiles emission and essential oils from different organs and pollen of Cistus albidus from Caprione (Eastern Liguria, Italy),
Flavour Fragr. J., 2007, 22, 1, 61-65, https://doi.org/10.1002/ffj.1759
. [all data]
Martins, Santos, et al., 2007
Martins, F.T.; Santos, M.H.; Polo, M.; Barbosa, L.C.A.,
Effects of the interactions among macronutrients, plant age and photoperiod in the composition of Hyptis suaveolens (L.) Poit essential oil from Alfenas (MG), Brazil,
Flavour Fragr. J., 2007, 22, 2, 123-129, https://doi.org/10.1002/ffj.1769
. [all data]
Melo, Corrêa, et al., 2007
Melo, R.M.; Corrêa, V.F.S.; Amorim, A.C.L.; Miranda, A.L.P.; Rezende, C.M.,
Identification of Impact Aroma Compounds in Eugenia uniflora L. (Brazilian Pitanga) Leaf Essential Oil,
J. Braz. Chem. Soc., 2007, 18, 1, 179-183, https://doi.org/10.1590/S0103-50532007000100020
. [all data]
Simoniatto, Bonani, et al., 2007
Simoniatto, E.; Bonani, V.F.L.; Morel, A.F.; Poppi, N.R.; Raposo, J.L., Jr.; Stuker, C.Z.; Peruzzo, G.M.; Peres, M.T.L.P.; Hess, S.C.,
Chemical composition and evaluation of antibacterial and antioxidant activities of the essential oil of Croton urucurana Baillon (Euphorbiaceae) stem bark,
J. Braz. Chem., 2007, 18, 5, 879-885, https://doi.org/10.1590/S0103-50532007000500002
. [all data]
Pavlovic, Tzakou, et al., 2006
Pavlovic, M.; Tzakou, O.; Petrakis, P.V.; Couladis, M.,
The essential oil of Hypericum perforatum L., Hypericum tetrapterum Fries and Hypericum olympicum L. growing in Greece,
Flavour Fragr. J., 2006, 21, 1, 84-87, https://doi.org/10.1002/ffj.1521
. [all data]
Su, Ho, et al., 2006
Su, Y.C.; Ho, C.L.; Wang, E.I.C.,
Analysis of leaf essential oils from the indigenous five conifers of Taiwan,
Flavour Fragr. J., 2006, 21, 3, 447-452, https://doi.org/10.1002/ffj.1685
. [all data]
Paolini, Costa, et al., 2005
Paolini, J.; Costa, J.; Bernardini, A.,
Analysis of the essential oil from aerial parts of Eupatorium cannabinum subsp. corsicum (L.) by gas chromatography with electron impact and chemical ionization mass spectrometry,
J. Chromatogr. A, 2005, 1076, 1-2, 170-178, https://doi.org/10.1016/j.chroma.2005.03.131
. [all data]
Dugo, Mondello, et al., 2004
Dugo, P.; Mondello, L.; Zappia, G.; Bonaccorsi, I.; Cotroneo, A.; Russo, M.T.,
The composition of the volatile fraction and the enantiomeric distribution of five volatile components of faustrime oil (Monocitrus australatica x Fortunella sp. x Citrus aurantifolia),
J. Essent. Oil Res., 2004, 16, 4, 328-333, https://doi.org/10.1080/10412905.2004.9698734
. [all data]
Flamini, Luigi Cioni, et al., 2004
Flamini, G.; Luigi Cioni, P.; Morelli, I.,
Essential oils of Galeopsis pubescens and G. tetrahit from Tuscany (Italy),
Flavour Fragr. J., 2004, 19, 4, 327-329, https://doi.org/10.1002/ffj.1307
. [all data]
Javidnia, Miri, et al., 2004
Javidnia, K.; Miri, R.; Jafari, A.; Rezai, H.,
Analysis of the volatile constituents of Nepeta macrosiphon Boiss. grown in Iran,
Flavour Fragr. J., 2004, 19, 2, 156-158, https://doi.org/10.1002/ffj.1287
. [all data]
Demetzos, Angelopoulou, et al., 2002
Demetzos, C.; Angelopoulou, D.; Perdetzoglou, D.,
A comparative study of the essential oils of Cistus salviifolius in several populations of Crete (Greece),
Biochem. Syst. Ecol., 2002, 30, 7, 651-665, https://doi.org/10.1016/S0305-1978(01)00145-4
. [all data]
Miri, Ramezani, et al., 2002
Miri, R.; Ramezani, M.; Javidnia, K.; Ahmadi, L.,
Composition of the volatile oil of Thymus transcaspicus Klokov from Iran,
Flavour Fragr. J., 2002, 17, 4, 245-246, https://doi.org/10.1002/ffj.1104
. [all data]
Couladis, Tsortanidou, et al., 2001
Couladis, M.; Tsortanidou, V.; Francisco-Ortega, J.; Santos-Guerra, A.; Harvala, C.,
Composition of the essential oils of Argyranthemum species growing in the Canary Islands,
Flavour Fragr. J., 2001, 16, 2, 103-106, https://doi.org/10.1002/ffj.954
. [all data]
Skaltsa, Lazari, et al., 2000
Skaltsa, H.D.; Lazari, D.M.; Loukis, A.E.; Constantinidis, T.,
Essential oil analysis of Nepeta argolica Bory Chaub. subsp. argolica (Lamiaceae) growing wild in Greece,
Flavour Fragr. J., 2000, 15, 2, 96-99, https://doi.org/10.1002/(SICI)1099-1026(200003/04)15:2<96::AID-FFJ873>3.0.CO;2-F
. [all data]
Bicchi, Rubiolo, et al., 1998
Bicchi, C.; Rubiolo, P.; Marschall, H.; Weyerstahl, P.; Laurent, R.,
Constituents of Artemisia roxburghiana Besser essential oil,
Flavour Fragr. J., 1998, 13, 1, 40-46, https://doi.org/10.1002/(SICI)1099-1026(199801/02)13:1<40::AID-FFJ688>3.0.CO;2-Z
. [all data]
Andriamaharavo, 2014
Andriamaharavo, N.R.,
Retention Data. NIST Mass Spectrometry Data Center., NIST Mass Spectrometry Data Center, 2014. [all data]
Bruni, Pellati, et al., 2005
Bruni, R.; Pellati, F.; Grazia Bellardi, M.; Benvenuti, S.; Paltrinieri, S.; Bertaccini, A.; Bianchi, A.,
Herbal drug quality and phytochemical composition of Hypericum perforatum L. affected by ash yellows phytoplasma infection,
J. Agric. Food Chem., 2005, 53, 4, 964-968, https://doi.org/10.1021/jf0487654
. [all data]
Oliveira, Campos, et al., 2005
Oliveira, M.J.; Campos, I.F.P.; Oliveira, C.B.A.; Santos, M.R.; Souza, P.S.; Santos, S.C.; Seraphin, J.C.; Ferri, P.H.,
Influence of growth phase on the essential oil composition of Hyptis suaveolens,
Biochem. Syst. Ecol., 2005, 33, 3, 275-285, https://doi.org/10.1016/j.bse.2004.10.001
. [all data]
Sacchetti, Medici, et al., 2004
Sacchetti, G.; Medici, A.; Maietti, S.; Radice, M.; Muzzoli, M.; Manfredini, S.; Braccioli, E.; Bruni, R.,
Composition and functional properties of the essential oil of Amazonian basil, Ocimum micranthum Willd., Labiatae in comparison with commercial essential oils,
J. Agric. Food Chem., 2004, 52, 11, 3486-3491, https://doi.org/10.1021/jf035145e
. [all data]
Azevedo, Campos, et al., 2002
Azevedo, N.R.; Campos, I.F.P.; Ferreira, H.D.; Portes, T.A.; Seraphin, J.C.; de Paula, J.R.; Santos, S.C.; Ferri, P.H.,
Essential oil chemotypes in Hyptis suaveolens from Brazilian Cerrado,
Biochem. Syst. Ecol., 2002, 30, 3, 205-216, https://doi.org/10.1016/S0305-1978(01)00075-8
. [all data]
Radulovic, Dordevic, et al., 2010
Radulovic, N.S.; Dordevic, N.D.; Palic, R.M.,
Volatiles of Pleurospermum austriacum (L.) Hoffm. (Apiaceae),
J. Serbian Chem. Soc., 2010, 75, 12, 1-11, https://doi.org/10.2298/JSC100323127R
. [all data]
Retta, Gattuso, et al., 2009
Retta, D.; Gattuso, M.; Gattuso, S.; Lira, P. Di Leo; van Baren, C.; Ferraro, G.; Bandoni A.,
Essential oil composition of Achyrocline flaccida (Weinm.) DC. (Asteraceae) from different locations of Argentina,
Biochem. Systematics Ecol., 2009, 36, 12, 877-881, https://doi.org/10.1016/j.bse.2008.11.001
. [all data]
Noudogbessi, Yedomonhan, et al., 2008
Noudogbessi, J.-P.; Yedomonhan, P.; Sohounhloue, D.C.K.; Chalchat, J.-C.; Figueredo, G.,
Chemical composition of essential oil of syzygium guineense (Willd.) DC. var. guineense (Myrtaceae) from Benin,
Rec. Nat. Prod., 2008, 33-38. [all data]
Paolini, Tomi, et al., 2008
Paolini, J.; Tomi, P.; Bernardini, A.-F.; Bradesi, P.; Casanova, J.; Kaloustian, J.,
Detailed analysis of the essential oil from Cistus albidus L. by combination of GC/RI, GC/MS and 13C-NMR spectroscopy,
N.Z. J. Agric. Res., 2008, 22, 14, 1270-1278. [all data]
Raj, Baby, et al., 2008
Raj, G.; Baby, S.; Dan, M.; Thaha, A.R.M.; Sethuraman, M.G.; George, V.,
Volatile constituents from the rhisomes of Curcuma haritha Mangaly and Sabu from Sauthern India,
Flavour Fragr. J., 2008, 23, 5, 348-352, https://doi.org/10.1002/ffj.1891
. [all data]
Bos, Woerdenbag, et al., 2007
Bos, R.; Woerdenbag, H.J.; Kayser, O.; Quax, W.J.; Ruslan, K.; Elfami,
Essential oil constituents of Piper cubeba L. fils. from Indonesia,
J. Essent. Oil Res., 2007, 19, 1, 14-17, https://doi.org/10.1080/10412905.2007.9699217
. [all data]
Elfami, Bos, et al., 2007
Elfami; Bos, R.; Ruslan, K.; Woerdenbag, H.J.; Kayser, P.; Quax, W.J.,
Essential Oil Constituents of Piper cubeba from Indonesia, 2007, 53-60. [all data]
Gudaityte and Venskutonis R.P., 2007
Gudaityte, O.; Venskutonis R.P.,
Chemotypes of Achillea millefolium transferred from 14 different locations in Lithuania to the controlled environment,
Biochem. Syst. Ecol., 2007, 35, 9, 582-592, https://doi.org/10.1016/j.bse.2007.03.016
. [all data]
Moreno, Lima, et al., 2007
Moreno, P.R.H.; Lima, M.E.L.; Sobral, M.; Young, M.C.M.; Cordeiro, I.; Apel, M.A.A.; Limberger, R.P.; Henriques, A.T.,
Essential oil composition of fruit colour varieties of Eugenia brasiliensis Lam.,
Sci. Agr.; (Piracicaba Praz.), 2007, 64, 4, 428-432. [all data]
Rojas, Velasco, et al., 2007
Rojas, J.; Velasco, J.; Rojas, L.B.; Carmona, J.; Morales, A.,
Chemical composition and antimicrobial activity of the essential oil of Baacharis latifolia Pers. and B. prunifolia H.B.K. (Asteraceae),
Natural Product Communications, 2007, 2, 12, 1245-1248. [all data]
Smelcerovic, Spiteller, et al., 2007
Smelcerovic, A.; Spiteller, M.; Ligon, A.P.; Smelcerovic, Z.; Raabe, N.,
Essential oil composition of Hypericum L. species from Southeastern Serbia and their chemotaxonomy,
Biochem. Syst. Ecol., 2007, 35, 2, 99-113, https://doi.org/10.1016/j.bse.2006.09.012
. [all data]
Apel, Sobral, et al., 2006
Apel, M.A.; Sobral, M.; Zuanazzi, J.A.S.; Henriques, A.T.,
Essential oil composition of four Plinia species (Myrtaceae),
Flavour Fragr. J., 2006, 21, 3, 565-567, https://doi.org/10.1002/ffj.1638
. [all data]
Apel, Sobral, et al., 2006, 2
Apel, M.A.; Sobral, M.; Zuanazzi, J.A.S.; Henriques, A.T.,
Essential oil composition of Calycorectes australis and Calycorectes psidiiflorus (Myrtaceae),
Flavour Fragr. J., 2006, 21, 4, 656-658, https://doi.org/10.1002/ffj.1640
. [all data]
Elfami, Komar, et al., 2006
Elfami, R.B.; Komar, R.; Woerdenbag, H.J.; Kayser, P.; Quax, W.J.,
Essential oil constituents of Piper cubeba from Indonesia, 2006, retrieved from http://dissertations.ub.rug.nl/FILES/facultiew/science/2006/elfahmi/05c5.pdf. [all data]
Figuérédo, Cabassu, et al., 2006
Figuérédo, G.; Cabassu, P.; Chalchat, J.-C.; Pasquier, B.,
Studies of Mediterranean oregano populations. VIII. Chemical composition of essential oils of oreganos of various origins,
Flavour Fragr. J., 2006, 21, 1, 134-139, https://doi.org/10.1002/ffj.1543
. [all data]
Garneau F.X., Collin G., et al., 2006
Garneau F.X.; Collin G.; Gagnon H.; Jean F.I.; Strobl H.; Pichette A.,
The essential oil composition of Devil's Club, Oplopanax horridus J. E. Smith Miq.,
Flavour Fragr. J., 2006, 21, 5, 792-794, https://doi.org/10.1002/ffj.1716
. [all data]
Morteza-Semnani K., Saeedi M., et al., 2006
Morteza-Semnani K.; Saeedi M.; Changizi S.,
The essential oil composition of Hypericum scabrum L. from Iran,
Flavour Fragr. J., 2006, 21, 3, 513-515, https://doi.org/10.1002/ffj.1614
. [all data]
Ouamba, Ouabonzi, et al., 2006
Ouamba, J.-M.; Ouabonzi, A.; Ekouya, A.; Bessière, J.-M.; Menut, C.; Abena, A.A.; Banzouzi, J.-T.,
Volatile constituents of the essential oil leaf of Lantana salvifolia Jacq. (Verbenaceae),
Flavour Fragr. J., 2006, 21, 1, 158-161, https://doi.org/10.1002/ffj.1553
. [all data]
Pala-Paul J., Perez-Alonso M.J., et al., 2006
Pala-Paul J.; Perez-Alonso M.J.; Velasco-Negueruela A.; Ballesteros M.T.; Sanz J.,
Essential oil composition of Sideritis hirsuta L. from Guadalajara Province, Spain,
Flavour Fragr. J., 2006, 21, 3, 410-415, https://doi.org/10.1002/ffj.1727
. [all data]
Sabulal, Dan, et al., 2006
Sabulal, B.; Dan, M.; Pradeep, N.S.; Valsamma, R.K.; George, V.,
Composition and antimicrobial activity of essential oil from the fruits of Amomum cannicarpum,
Acta Pharm. Sin., 2006, 56, 473-480. [all data]
Sajjadi, 2006
Sajjadi, S.E.,
Analysis of the essential oils of two cultivated basil (Icimum basilicum L.) from Iran,
DARU, 2006, 14, 3, 128-130. [all data]
Tigrine-Kordiani, Meklati, et al., 2006
Tigrine-Kordiani, N.; Meklati, B.Y.; Chemat, F.,
Abalysis by gas chromatography - mass spectrometry of the essential oil of Zygophyllum album L., an aromatic and medicinal plant growing in Algeria,
Int. J. Aromatherapy, 2006, 16, 3-4, 187-191, https://doi.org/10.1016/j.ijat.2006.09.008
. [all data]
Chagonda and Chalchat, 2005
Chagonda, L.S.; Chalchat, J.-C.,
The essential oil of the fruit of Garcinia huillensis Welw. ex. Oliv. from Zimbabwe,
Flavour Fragr. J., 2005, 20, 3, 313-315, https://doi.org/10.1002/ffj.1420
. [all data]
Figuérédo, Cabassu, et al., 2005
Figuérédo, G.; Cabassu, P.; Chalchat, J.-C.; Pasquier, B.,
Studies of Mediterranean oregano populations- V. Chemical composition of essential oils of oregano: Origanum syriacum L. var. bevanii (Holmes) Ietswaart, O. syriacum L. var. sinaicum (Boiss.) Ietswaart, and O. syriacum L. var. syriacum from Lebanon and Israel,
Flavour Fragr. J., 2005, 20, 164-168. [all data]
Ghasemi Y., Faridi P., et al., 2005
Ghasemi Y.; Faridi P.; Mehregan I.; Mohagheghzadeh A.,
Ferula gummosa fruits: An aromatic antimicrobial agent,
Chem. Nat. Compd. (Engl. Transl.), 2005, 41, 3, 311-314, https://doi.org/10.1007/s10600-005-0138-3
. [all data]
Pala-Paul, Perez-Alonso, et al., 2005
Pala-Paul, J.; Perez-Alonso, M.J.; Velasco-Negueruela, A.; Vadare, J.; Villa, A.M.; Sanz, J.; Brophy, J.J.,
Essential oil composition of the different parts of Eryngium bourgatii Gouan from Spain,
J. Chromatogr. A, 2005, 1074, 1-2, 235-239, https://doi.org/10.1016/j.chroma.2005.03.036
. [all data]
Salehi, Sefidkon, et al., 2005
Salehi, P.; Sefidkon, F.; Bazzaz Tolami, L.; Sonboli, A.,
Essential oil composition of Salvia palaestina Benth. from Iran,
Flavour Fragr. J., 2005, 20, 5, 525-527, https://doi.org/10.1002/ffj.1448
. [all data]
Setzer, Noletto, et al., 2005
Setzer, W.N.; Noletto, J.A.; Lawton, R.O.; Haber, W.A.,
Leaf essential oil composition of five Zanthoxylum species from Monteverde, Costa Rica,
Molecular Diversity, 2005, 9, 1-3, 3-13, https://doi.org/10.1007/s11030-005-1298-6
. [all data]
Slavkovska, Couladis, et al., 2005
Slavkovska, V.; Couladis, M.; Bojovic, S.; Tzakou, O.; Pavlovic, M.; Lakusic, B.; Jancic, R.,
Essential oil and its systematic significance in species of Micromeria Bentham from Serbia Montenegro,
Plant Systematics and Evolution, 2005, 255, 1-2, 1-15, https://doi.org/10.1007/s00606-005-0303-y
. [all data]
Tzakou and Constantinidis, 2005
Tzakou, O.; Constantinidis, T.,
Chemotaxonomic significance of volatile compounds in Thymus samius and its related species Thymus atticus and Thymus parnassicus,
Biochem. Syst. Ecol., 2005, 33, 11, 1131-1140, https://doi.org/10.1016/j.bse.2005.03.008
. [all data]
Agnaniet, Menut, et al., 2004
Agnaniet, H.; Menut, C.; Bessière, J.-M.,
Aromatic plants of tropical central Africa. Part XLIX: chemical composition of essential oils of the leaf and rhizome of Aframomum giganteum K. Schum from Gabon,
Flavour Fragr. J., 2004, 19, 3, 205-209, https://doi.org/10.1002/ffj.1403
. [all data]
Limberger, Sobral, et al., 2004
Limberger, R.P.; Sobral, M.; Henriques, A.T.; Menut, C.; Bessière, J.-M.,
Óleos voláteis de espécies de Myrcia nativas do rio grande do sul,
Quim. Nova, 2004, 27, 6, 916-919, https://doi.org/10.1590/S0100-40422004000600015
. [all data]
Marongiu, Porcedda, et al., 2004
Marongiu, B.; Porcedda, A.P.S.; Casu, R.; Pierucci, P.,
Chemical composition of the oil and supercritical CO2 extract of Schinus molle L.,
Flavour Fragr. J., 2004, 19, 6, 554-558, https://doi.org/10.1002/ffj.1350
. [all data]
Feizbaksh, Saber Tehrani, et al., 2003
Feizbaksh, A.; Saber Tehrani, M.; Rustaiyan, A.; Masoudi, S.,
Composition of the essential oil of Stachys lavandulifolia Vahl. from Iran,
J. Essent. Oil Res., 2003, 15, 2, 72-73, https://doi.org/10.1080/10412905.2003.9712068
. [all data]
Fekam Boyom, Ngouana, et al., 2003
Fekam Boyom, F.; Ngouana, V.; Amvam Zollo, P.H.; Menut, C.; Bessiere, J.M.; Gut, J.; Rosenthal, P.J.,
Composition and anti-plasmodial activities of essential oils from some Cameroonian medicinal plants,
Phytochemistry, 2003, 64, 7, 1269-1275, https://doi.org/10.1016/j.phytochem.2003.08.004
. [all data]
Ghasemi, Asghari, et al., 2003
Ghasemi, N.; Asghari, G.; Ardakani, M.S.; Siahpoush, A.,
Characterization of volatile constituents from aerial parts of varthemia persica DC (var. persica),
Iran. J. Pharm. Res., 2003, 2, 241-243. [all data]
Limberger, Simões-Pires, et al., 2003
Limberger, R.P.; Simões-Pires, C.A.; Sobral, M.; Menut, C.; Bessiere, J.-M.; Henriques, A.T.,
Essential oils of six Gomidesia spp. from southern Brazil,
Flavour Fragr. J., 2003, 18, 2, 144-147, https://doi.org/10.1002/ffj.1122
. [all data]
Pino, Marbot, et al., 2003
Pino, J.A.; Marbot, R.; Fuentes, V.,
Characterization of volatiles in Bullock's heart (Annona reticulata L.) fruit cultivars from Cuba,
J. Agric. Food Chem., 2003, 51, 13, 3836-3839, https://doi.org/10.1021/jf020733y
. [all data]
Pitarokili, Tzakou, et al., 2003
Pitarokili, D.; Tzakou, O.; Loukis, A.; Harvala, C.,
Volatile metabolites from Salvia fruticosa as antifungal agents in soilborne pathogens,
J. Agric. Food Chem., 2003, 51, 11, 3294-3301, https://doi.org/10.1021/jf0211534
. [all data]
Iñigo, Palá-Paúl, et al., 2002
Iñigo, A.; Palá-Paúl, J.; Pérez-Alonso, M.J.; Velasco-Negueruela, A.,
Essential oil composition from the aerial parts of Haplophyllum linifolium (L.) G. Don fil.,
Botanica Complutensis, 2002, 26, 79-83. [all data]
Kabouss, Charrouf, et al., 2002
Kabouss, A.E.; Charrouf, Z.; Faid, M.; Garneau, F.-X.; Collin, G.,
Chemical composition and antimicrobial activity of the leaf essential oil of Argania spinosa L. Skeels,
J. Essent. Oil Res., 2002, 14, 2, 147-149, https://doi.org/10.1080/10412905.2002.9699801
. [all data]
Limberger, Simões-Pires, et al., 2002
Limberger, R.P.; Simões-Pires, C.; Sobral, M.; Menu, C.; Bessiere, J.-M.; Henriques, A.T.,
Essential oils from some Myrceugenia species (Myrtaceae),
Flavour Fragr. J., 2002, 17, 5, 341-344, https://doi.org/10.1002/ffj.1113
. [all data]
Maia, Zoghbi, et al., 2002
Maia, J.G.S.; Zoghbi, M.G.B.; Andrade, E.H.A.; da Silva, M.H.L.; Luz, A.I.R.; da Silva, J.D.,
Essential oils composition of Eupatorium species growing wild in the Amazon,
Biochem. Syst. Ecol., 2002, 30, 11, 1071-1077, https://doi.org/10.1016/S0305-1978(02)00059-5
. [all data]
Monfared, Davarani, et al., 2002
Monfared, A.; Davarani, S.S.H.; Rustaiyan, A.; Masoudi, S.,
Composition of the essential oil of Tanacetum balsamita L. ssp. balsamitoides (Schultz Bip.) Grierson from Iran,
J. Essent. Oil Res., 2002, 14, 1, 1-2, https://doi.org/10.1080/10412905.2002.9699741
. [all data]
Velasco-Negueruela, Pérez-Alonso, et al., 2002
Velasco-Negueruela, A.; Pérez-Alonso, M.J.; Palá-Paúl, J.; Íñigo, A.; López, G.,
Leaf essential oils analysis of Juniperus navicularis Gandoger,
Botanica Complutensis, 2002, 26, 85-91. [all data]
Zoghbi, Andrade, et al., 2002
Zoghbi, M.G.B.; Andrade, E.H.A.; da Silva, M.H.L.; Maia, J.G.S.,
Volatile constituents of Lippia lupulina Cham.,
Flavour Fragr. J., 2002, 17, 1, 29-31, https://doi.org/10.1002/ffj.1032
. [all data]
Santos, Moreira, et al., 2001
Santos, P.R.; Moreira, D.L.; Guimaraes, E.F.; Kaplan, M.A.C.,
Essential oil analysis of 10 piperaceae species from the Brazilian Atlantic forest,
Phytochemistry, 2001, 58, 4, 547-551, https://doi.org/10.1016/S0031-9422(01)00290-4
. [all data]
Gazim, Rezende, et al., 2008
Gazim, Z.C.; Rezende, C.M.; Fraga, S.R.; Filho, B.P.D.; Cortez, D.A.G.,
Analysis of the essential oils from Calendula officinalis growing in Brazil using three different exteraction procedures,
Brazilian J. Pharmaceutical Sci., 2008, 44, 3, 391-395. [all data]
Kupcinskiene, Stikliene, et al., 2008
Kupcinskiene, E.; Stikliene, A.; Judzentiene, A.,
The essential oil guatitative composition in the needles of Pinus sylvestris L. growing along industrial transects,
Environ. Pollution, 2008, 155, 3, 481-491, https://doi.org/10.1016/j.envpol.2008.02.001
. [all data]
Santos, Costa, et al., 2008
Santos, P.O.; Costa, M. deJ.C.; Alves, J.A.B.; Nascimento, P.F.C.; de Melo, D.L.F.M.; Barbosa, A.M., Jr.; Trindade, R. de.C.; Blank, A.F.; Arrigoni-Blank, M.F.; Alves, P.B.; do Nascimento, M. da.P.F.,
Chemical composition and antimicrobial activity of the essential oil of Hyptis pectinata (L.) Poit.,
Quim. Nova., 2008, 31, 7, 1648-1652, https://doi.org/10.1590/S0100-40422008000700009
. [all data]
Cole, Haber, et al., 2007
Cole, R.A.; Haber, W.A.; Setzer, W.N.,
Chemical composition of essential oils of seven species of Eugenia from Monteverde, Costa Rica,
Biochem. Syst. Ecol., 2007, 35, 12, 877-886, https://doi.org/10.1016/j.bse.2007.06.013
. [all data]
Moriarity, Bansal, et al., 2007
Moriarity, D.M.; Bansal, A.; Cole, R.A.; Takaku, S.; Haber, W.A.; Setzer, W.N.,
Selective cytotoxic activities of leaf essential oils from Monteverde Costa Rica,
Natural Product Communications, 2007, 2, 12, 1263-1268. [all data]
Stokes, Cole, et al., 2007
Stokes, S.L.; Cole, R.A.; Rangelova, M.P.; Haber, W.A.; Setzer, W.N.,
Cruzain inhibitory activity of the leaf essential oil from an undescribed species of Eugenia from Monteverde, Costa Rica,
Natural Product Communications, 2007, 2, 12, 1211-1213. [all data]
Takaku, Haber, et al., 2007
Takaku, S.; Haber, W.A.; Setzer, W.N.,
Leaf essential oil composition of 10 species of Ocotea (Lauraceae) from Monteverde, Costa Rica,
Biochem. Syst. Ecol., 2007, 35, 8, 525-532, https://doi.org/10.1016/j.bse.2007.02.003
. [all data]
Werka, Boehme, et al., 2007
Werka, J.S.; Boehme, A.K.; Setzer, W.N.,
Biological activities of essential oils from Monteverde, Costa Rica,
Natural Product Communications, 2007, 2, 12, 1215-1219. [all data]
Schmidt, Noletto, et al., 2006
Schmidt, J.M.; Noletto, J.A.; Vogler, B.; Setzer, W.N.,
Abaco Bush Medicine: Chemical composition of the essential oils of four aromatic medicinal plants from Abaco Island, Bahamas,
J. Herbs, Spices Medicinal Plants, 2006, 12, 3, 43-65, https://doi.org/10.1300/J044v12n03_04
. [all data]
Tognolini, Barocelli, et al., 2006
Tognolini, M.; Barocelli, E.; Ballabeni, V.; Bruni, R.; Bianchi, A.; Chiavarini, M.; Impicciatore, M.,
Comparative screening of plant essential oils: Phenylpropanoid moiety as basic core for antiplatelet activity,
Life Sciences, 2006, 78, 13, 1419-1432, https://doi.org/10.1016/j.lfs.2005.07.020
. [all data]
Butkienë, Nivinskienë, et al., 2005
Butkienë, R.; Nivinskienë, O.; Mockutë, D.,
α-Pinene chemotype of leaf (needle) essential oils of Juniperus communis L. growing wild in Vilnius district,
Chemija, 2005, 16, 1, 53-60. [all data]
de Menezes, Lemos, et al., 2005
de Menezes, J.E.S.A.; Lemos, T.L.G.; Silveira, E.R.; Andrade-Neto, M.; Nascimento, R.F.; Pessoa, O.D.L.,
Volatile constituents of Cordia trichotoma Vell. from the northeast of Brazil,
Flavour Fragr. J., 2005, 20, 2, 149-151, https://doi.org/10.1002/ffj.1394
. [all data]
Butkienë, Nivinskienë, et al., 2004
Butkienë, R.; Nivinskienë, O.; Mockutë, D.,
Chemical composition of unripe and ripe berry essential oils of Juniperus communis L. growing wild in Vilnius district,
Chemija, 2004, 15, 4, 57-63. [all data]
El-Shazly and Hussein, 2004
El-Shazly, A.M.; Hussein, K.T.,
Chemical analysis and biological activities of the essential oil of Teucrium leucocladum Boiss. (Lamiaceae),
Biochem. Syst. Ecol., 2004, 32, 7, 665-674, https://doi.org/10.1016/j.bse.2003.12.009
. [all data]
Mockute, Nivinskiene, et al., 2003
Mockute, D.; Nivinskiene, O.; Bernotiene, G.; Butkiene, R.,
The cis-thujone chemotype of Salvia officinalis L. essential oils,
Chemija, 2003, 14, 4, 216-220. [all data]
Ferreira, Costantin, et al., 2001
Ferreira, M.J.P.; Costantin, M.B.; Sartorelli, P.; Rodrigues, G.V.; Limberger, R.; Henriques, A.T.; Kato, M.J.; Emerenciano, V.P.,
Computer-aided method for identification of components in essential oils by 13C NMR spectroscopy,
Anal. Chim. Acta., 2001, 447, 1-2, 125-134, https://doi.org/10.1016/S0003-2670(01)01204-1
. [all data]
Weyerstahl, Marschall, et al., 1998
Weyerstahl, P.; Marschall, H.; Thefeld, K.; Subba, G.C.,
Constituents of the essential oil from the rhizomes of Hedychium gardnerianum Roscoe,
Flavour Fragr. J., 1998, 13, 6, 377-388, https://doi.org/10.1002/(SICI)1099-1026(199811/12)13:6<377::AID-FFJ755>3.0.CO;2-F
. [all data]
Weyerstahl, Marschall, et al., 1998, 2
Weyerstahl, P.; Marschall, H.; Wolf, D.,
Constituents of commercial Brazilian cabore oil,
Flavour Fragr. J., 1998, 13, 2, 85-86, https://doi.org/10.1002/(SICI)1099-1026(199803/04)13:2<85::AID-FFJ697>3.0.CO;2-9
. [all data]
Kurose, Okamura, et al., 2007
Kurose, K.; Okamura, D.; Yatagai, M.,
Composition of the essential oils from the leaves of nine Pinus species and the cones of three of Pinus species,
Flavour Fragr. J., 2007, 22, 1, 10-20, https://doi.org/10.1002/ffj.1609
. [all data]
Paniandy, Chane-Ming, et al., 2000
Paniandy, J.-C.; Chane-Ming, J.; Pierbattesti, J.-C.,
Chemical Composition of the Essential Oil and Headspace Solid-Phase Microextraction of the Guava Fruit (Psidium guajava L.),
J. Essent. Oil Res., 2000, 12, 153-158. [all data]